{"text_format":"1","workbook":"xlsx","n_sheets":21,"sheets":["HomePage","Start Menu","SA_Inp1","SA_Inp2","SB_Inp1","SB_Inp2","MCA_Inp","Modules","SA_UCalc","SB_UCalc","Energy","SA_LCA","SB_LCA","Comp_LCA","SA_CostBen","SB_CostBen","Comp_CostBen","MCA","Mat_DB","Loc_DB","Calculation"],"not_rendered":{"charts":4,"images":9,"macros":1,"external_links":0,"defined_names":0,"comments":13,"pivot_tables":0},"unopened":[],"bounds":{"document_bytes":16777216,"sheet_cells":100000,"rows_first":2000,"rows_last":500,"rows_between":2000,"halvings":0,"cell_chars":16384,"cell_head_chars":4096},"cells_cut":0,"cells_raw":0,"read":"whole","date_system":"1900"}

{"sheet":"HomePage","index":0,"n_rows":0,"n_cols":0,"rows_kept":0,"cut":false,"hidden":false,"merged":[]}

{"sheet":"Start Menu","index":1,"n_rows":36,"n_cols":20,"rows_kept":36,"cut":false,"hidden":false,"merged":[[6,19,6,20],[5,1,5,8],[6,1,6,2],[6,3,6,8],[6,9,6,10],[6,11,6,16],[6,17,6,18],[11,6,12,15],[10,6,10,15],[17,6,18,15],[23,6,24,15],[16,6,16,15],[22,6,22,15]]}
[]
[]
[]
[]
[]
[]
[null,"User name:",null,{"$f":"B34","v":"Telmo Miguel Martins Ribeiro"},null,null,null,null,null,"File name:",null,{"$f":"B35","v":"Tyre4BuildIns Project"},null,null,null,null,null,"Date:",null,{"$f":"B36","v":"2022-06-25"}]
[]
[]
[]
[null,null,null,null,null,null,"Username"]
[null,null,null,null,null,null,"Telmo Miguel Martins Ribeiro"]
[]
[]
[]
[]
[null,null,null,null,null,null,"File name"]
[null,null,null,null,null,null,"Tyre4BuildIns Project"]
[]
[]
[]
[]
[null,null,null,null,null,null,"Date"]
[null,null,null,null,null,null,"2022-06-25"]
[]
[]
[]
[]
[]
[]
[]
[]
[]
[null,{"$f":"G12","v":"Telmo Miguel Martins Ribeiro"}]
[null,{"$f":"G18","v":"Tyre4BuildIns Project"}]
[null,{"$f":"G24","v":"2022-06-25"}]

{"sheet":"SA_Inp1","index":2,"n_rows":27,"n_cols":20,"rows_kept":27,"cut":false,"hidden":false,"merged":[[6,17,6,18],[6,19,6,20],[6,1,6,2],[6,3,6,8],[6,9,6,10],[13,2,13,10],[9,8,10,13],[7,8,7,13],[6,11,6,16],[14,2,14,3],[14,5,14,11],[8,3,8,4],[9,3,9,4],[10,3,10,4],[11,3,11,4],[17,39,17,47],[18,39,18,40],[18,41,18,42],[16,7,16,9],[14,12,16,12],[14,13,14,19],[15,15,15,17],[18,13,18,19],[18,2,18,7],[15,5,15,6],[15,7,15,9],[15,13,15,14],[15,2,16,3],[16,5,16,6],[20,39,20,47],[21,2,21,3],[21,6,21,7],[21,10,21,11],[21,39,21,40],[21,41,21,42],[19,4,22,5],[19,6,19,7],[19,8,22,9],[19,10,19,11],[20,2,20,3],[20,6,20,7],[20,10,20,11],[22,2,22,3],[22,6,22,7],[22,10,22,11],[22,39,22,40],[22,41,22,42],[25,2,25,3],[25,4,25,5],[25,39,25,47],[24,2,24,7],[24,9,24,11],[25,9,26,10],[25,11,26,11],[25,13,25,14],[25,15,25,16],[24,13,24,19],[26,2,26,3],[26,4,26,5],[26,39,26,40],[26,41,26,42],[19,13,19,14],[19,15,19,16],[20,13,20,14],[20,15,20,16],[19,2,19,3]]}
[]
[]
[]
[]
[]
[]
[null,"User name:",null,{"$f":"'Start Menu'!D7:I7","v":"Telmo Miguel Martins Ribeiro"},null,null,null,null,null,"File name:",null,{"$f":"'Start Menu'!L7:Q7","v":"Tyre4BuildIns Project"},null,null,null,null,null,"Date:",null,{"$f":"'Start Menu'!T7:U7","v":"2022-06-25"}]
[null,null,null,null,null,null,null,null,"Solution A - Reference"]
[null,null,null,"Generic input"]
[null,null,"Color","Dropdown list input",null,null,null,null,"BUILDING FEATURES",null,null,null,null,null,null," "]
[null,null,"Legend","Input from database"]
[null,null,null,"Output value"]
[]
[null,null,"Location"]
[null,null,"Country",null,null,{"$f":"Calculation!CI13","v":"1 - Portugal [ENABLED]"},null,null,null,"Others",null,null,"←OR→",{"$f":"Calculation!CI14","v":"2 - Other Locations [DISABLED]"}]
[null,null,"1 - Portugal",null,null,"Municipality",null,"Coimbra",null,null,"HDD [˚C]",{"$f":"Calculation!GL10","v":1312},null,"Local",null,"Helsinki_FI",null,null,"HDD [˚C]",{"$f":"Calculation!GD37","v":4854}]
[null,null,null,null,null,"Altitude [m]",null,75,null,null,"CDD [˚C]",{"$f":"Calculation!GL11","v":500.20000000000022},null,null,null,null,null,null,"CDD [˚C]",{"$f":"Calculation!GD38","v":4}]
[]
[null,null,"Facades",null,null,null,null,null,null,null,null,null,null,"Climatization Systems"]
[null,null,"Main facade (MF)",null,"Length [m]",null,15,null,"Glazing Area [%]",null,12,null,null,"CoP",null,3.5]
[null,null,"Back facade (BF)",null,null,null,15,null,null,null,12,null,null,"EER",null,3.5]
[null,null,"Left facade (LF)",null,null,null,10,null,null,null,10]
[null,null,"Right facade (RF)",null,null,null,10,null,null,null,10]
[]
[null,null,"Floors",null,null,null,null,null,null,"Area of external walls",null,null,null,"Electricity Cost"]
[null,null,"Number of floors",null,2,null,null,null,null,{"$f":"(G20*(100-K20)*0.01+G21*(100-K21)*0.01+G22*(100-K22)*0.01+G23*(100-K23)*0.01)*E27*E26","v":239.76000000000005},null,"m2",null,"Cost [€/kWh]",null,0.25]
[null,null,"Height of each floor [m]",null,2.7]

{"sheet":"SA_Inp2","index":3,"n_rows":27,"n_cols":20,"rows_kept":27,"cut":false,"hidden":false,"merged":[[6,17,6,18],[15,3,15,5],[15,8,15,10],[15,15,15,16],[14,17,14,19],[15,17,15,19],[6,19,6,20],[7,8,7,13],[9,8,10,13],[13,2,13,10],[13,15,13,19],[14,2,15,2],[14,3,14,5],[14,8,14,10],[14,15,14,16],[5,1,5,8],[6,1,6,2],[6,3,6,8],[6,9,6,10],[6,11,6,16],[20,15,20,19],[21,15,21,16],[23,15,23,19],[24,15,24,16],[24,17,24,19],[21,17,21,19],[19,3,19,5],[19,8,19,10],[20,3,20,5],[20,8,20,10],[17,3,17,5],[16,15,16,16],[16,17,16,19],[17,8,17,10],[18,15,18,16],[18,3,18,5],[18,8,18,10],[16,3,16,5],[16,8,16,10],[17,17,17,19],[18,17,18,19],[17,15,17,16],[26,7,26,8],[21,3,21,5],[21,8,21,10],[22,3,22,5],[22,8,22,10],[23,3,23,5],[23,8,23,10],[24,3,24,5],[24,8,24,10],[25,3,25,5],[25,8,25,10]]}
[]
[]
[]
[]
[]
[]
[null,"User name:",null,{"$f":"'Start Menu'!D7:I7","v":"Telmo Miguel Martins Ribeiro"},null,null,null,null,null,"File name:",null,{"$f":"'Start Menu'!L7:Q7","v":"Tyre4BuildIns Project"},null,null,null,null,null,"Date:",null,{"$f":"'Start Menu'!T7:U7","v":"2022-06-25"}]
[null,null,null,null,null,null,null,null,"Solution A - Reference"]
[]
[null,null,null,null,null,null,null,null,"WALL CONFIGURATION"]
[]
[]
[]
[null,null,"Reference Wall (A)",null,null,null,null,null,null,null,null,null,null,null,null,"Lightweight Steel Frame (LSF)"]
[null,null,"Layer","Material 1",null,null,"λ","R","Material 2",null,null,"λ","R","Thickness",null,"Stud Spacing [mm]",null,400]
[null,"interior",null,"(Thickness) [Brand]",null,null,"[W/(m·K)]","[(m²·K)/W]","(only for non homogeneous layers)",null,null,"[W/(m·K)]","[(m²·K)/W]","[mm]",null,"Steel Structure",null,{"$f":"Calculation!CC20","v":"Steel C90/U93 (90 mm) [Pertecno]"}]
[null,null,1,"Gypsum Board (12,5 mm) [Gyptec]",null,null,{"$f":"Calculation!CP14","v":0.17499999999999999},{"$f":"Calculation!CS14","v":7.1428571428571438E-2},"---",null,null,{"$f":"Calculation!CY14","v":"---"},{"$f":"Calculation!DB14","v":"---"},{"$f":"Calculation!DE14","v":12.5},null,"Stud Thickness [mm]",null,{"$f":"Calculation!DM13*1000","v":1.5}]
[null,null,2,"OSB (12 mm) [Kronospan]",null,null,{"$f":"Calculation!CP15","v":0.13},{"$f":"Calculation!CS15","v":9.2307692307692313E-2},"---",null,null,{"$f":"Calculation!CY15","v":"---"},{"$f":"Calculation!DB15","v":"---"},{"$f":"Calculation!DE15","v":12},null,"Stud Depth [mm]",null,{"$f":"Calculation!DM12*1000","v":90}]
[null,null,3,"Mineral wool (90 mm) [Volcalis]",null,null,{"$f":"Calculation!CP16","v":3.5000000000000003E-2},{"$f":"Calculation!CS16","v":2.5714285714285712},"Steel C90/U93 (90 mm) [Pertecno]",null,null,{"$f":"Calculation!CY16","v":50},{"$f":"Calculation!DB16","v":1.8E-3},{"$f":"Calculation!DE16","v":90},null,"Flange Length [mm]",null,{"$f":"Calculation!DM15*1000","v":43}]
[null,null,4,"OSB (12 mm) [Kronospan]",null,null,{"$f":"Calculation!CP17","v":0.13},{"$f":"Calculation!CS17","v":9.2307692307692313E-2},"---",null,null,{"$f":"Calculation!CY17","v":"---"},{"$f":"Calculation!DB17","v":"---"},{"$f":"Calculation!DE17","v":12}]
[null,null,5,"Mortar (10 mm)",null,null,{"$f":"Calculation!CP18","v":1.8},{"$f":"Calculation!CS18","v":5.5555555555555558E-3},"---",null,null,{"$f":"Calculation!CY18","v":"---"},{"$f":"Calculation!DB18","v":"---"},{"$f":"Calculation!DE18","v":10},null,"Thermal Break Strips"]
[null,null,6,"---",null,null,{"$f":"Calculation!CP19","v":"---"},{"$f":"Calculation!CS19","v":"---"},"---",null,null,{"$f":"Calculation!CY19","v":"---"},{"$f":"Calculation!DB19","v":"---"},{"$f":"Calculation!DE19","v":"---"},null,"Width [mm]"]
[null,null,7,"---",null,null,{"$f":"Calculation!CP20","v":"---"},{"$f":"Calculation!CS20","v":"---"},"---",null,null,{"$f":"Calculation!CY20","v":"---"},{"$f":"Calculation!DB20","v":"---"},{"$f":"Calculation!DE20","v":"---"}]
[null,null,8,"---",null,null,{"$f":"Calculation!CP21","v":"---"},{"$f":"Calculation!CS21","v":"---"},"---",null,null,{"$f":"Calculation!CY21","v":"---"},{"$f":"Calculation!DB21","v":"---"},{"$f":"Calculation!DE21","v":"---"},null,"Sheathing Layers"]
[null,null,9,"---",null,null,{"$f":"Calculation!CP22","v":"---"},{"$f":"Calculation!CS22","v":"---"},"---",null,null,{"$f":"Calculation!CY22","v":"---"},{"$f":"Calculation!DB22","v":"---"},{"$f":"Calculation!DE22","v":"---"},null,"Thickness [mm]",null,24.5]
[null,null,10,"---",null,null,{"$f":"Calculation!CP23","v":"---"},{"$f":"Calculation!CS23","v":"---"},"---",null,null,{"$f":"Calculation!CY23","v":"---"},{"$f":"Calculation!DB23","v":"---"},{"$f":"Calculation!DE23","v":"---"}]
[null,"exterior",null,null,null,null,null,null,null,null,null,null,"Total",{"$f":"Calculation!DE24","v":136.5}]

{"sheet":"SB_Inp1","index":4,"n_rows":27,"n_cols":20,"rows_kept":27,"cut":false,"hidden":false,"merged":[[6,19,6,20],[6,17,6,18],[14,2,14,3],[6,1,6,2],[6,3,6,8],[6,9,6,10],[6,11,6,16],[7,8,7,13],[14,13,14,19],[14,12,16,12],[15,7,15,9],[15,5,15,6],[15,13,15,14],[15,2,16,3],[19,6,19,7],[14,5,14,11],[9,8,10,13],[13,2,13,10],[16,7,16,9],[25,9,26,10],[22,6,22,7],[25,11,26,11],[15,15,15,17],[25,2,25,3],[25,4,25,5],[26,2,26,3],[26,4,26,5],[25,13,25,14],[25,15,25,16],[19,2,19,3],[19,4,22,5],[21,2,21,3],[21,6,21,7],[21,10,21,11],[16,5,16,6],[24,2,24,7],[18,13,18,19],[19,13,19,14],[19,15,19,16],[20,13,20,14],[20,15,20,16],[24,13,24,19],[19,10,19,11],[20,2,20,3],[20,6,20,7],[20,10,20,11],[24,9,24,11],[18,2,18,7],[19,8,22,9],[22,10,22,11],[22,2,22,3]]}
[]
[]
[]
[]
[]
[]
[null,"User name:",null,{"$f":"'Start Menu'!D7:I7","v":"Telmo Miguel Martins Ribeiro"},null,null,null,null,null,"File name:",null,{"$f":"'Start Menu'!L7:Q7","v":"Tyre4BuildIns Project"},null,null,null,null,null,"Date:",null,{"$f":"'Start Menu'!T7:U7","v":"2022-06-25"}]
[null,null,null,null,null,null,null,null,"Solution B - Improved"]
[]
[null,null,null,null,null,null,null,null,"BUILDING FEATURES"]
[]
[]
[]
[null,null,"Location"]
[null,null,"Country",null,null,{"$f":"Calculation!CI33","v":"1 - Portugal [ENABLED]"},null,null,null,null,null,null,"←OR→",{"$f":"Calculation!CI34","v":"2 - Other Locations [DISABLED]"}]
[null,null,"1 - Portugal",null,null,"Municipality",null,"Coimbra",null,null,"HDD [˚C]",{"$f":"Calculation!GN10","v":1312},null,"Local",null,"Stockholm_SE",null,null,"HDD [˚C]",{"$f":"Calculation!GG37","v":4351}]
[null,null,null,null,null,"Altitude [m]",null,75,null,null,"CDD [˚C]",{"$f":"Calculation!GN11","v":500.20000000000022},null,null,null,null,null,null,"CDD [˚C]",{"$f":"Calculation!GG38","v":3}]
[]
[null,null,"Facades",null,null,null,null,null,null,null,null,null,null,"Climatization Systems"]
[null,null,"Main facade (MF)",null,"Length [m]",null,15,null,"Glazing Area [%]",null,12,null,null,"CoP",null,3.5]
[null,null,"Back facade (BF)",null,null,null,15,null,null,null,12,null,null,"EER",null,3.5]
[null,null,"Left facade (LF)",null,null,null,10,null,null,null,10]
[null,null,"Right facade (RF)",null,null,null,10,null,null,null,10]
[]
[null,null,"Floors",null,null,null,null,null,null,"Area of external walls",null,null,null,"Electricity Cost"]
[null,null,"Number of floors",null,2,null,null,null,null,{"$f":"(G20*(100-K20)*0.01+G21*(100-K21)*0.01+G22*(100-K22)*0.01+G23*(100-K23)*0.01)*E27*E26","v":239.76000000000005},null,"m2",null,"Cost [€/kWh]",null,0.25]
[null,null,"Height of each floor [m]",null,2.7]

{"sheet":"SB_Inp2","index":5,"n_rows":27,"n_cols":20,"rows_kept":27,"cut":false,"hidden":false,"merged":[[20,3,20,5],[21,3,21,5],[25,3,25,5],[22,3,22,5],[23,3,23,5],[24,3,24,5],[24,17,24,19],[22,8,22,10],[5,1,5,8],[6,1,6,2],[6,3,6,8],[6,9,6,10],[6,11,6,16],[6,17,6,18],[18,17,18,19],[20,15,20,19],[21,15,21,16],[21,17,21,19],[6,19,6,20],[15,17,15,19],[18,3,18,5],[19,3,19,5],[13,15,13,19],[15,15,15,16],[14,15,14,16],[16,15,16,16],[17,15,17,16],[7,8,7,13],[9,8,10,13],[14,3,14,5],[16,3,16,5],[17,3,17,5],[15,3,15,5],[13,2,13,10],[14,2,15,2],[16,8,16,10],[17,8,17,10],[26,7,26,8],[14,17,14,19],[16,17,16,19],[17,17,17,19],[18,15,18,16],[23,8,23,10],[24,8,24,10],[14,8,14,10],[15,8,15,10],[25,8,25,10],[18,8,18,10],[19,8,19,10],[20,8,20,10],[21,8,21,10],[23,15,23,19],[24,15,24,16]]}
[]
[]
[]
[]
[]
[]
[null,"User name:",null,{"$f":"'Start Menu'!D7:I7","v":"Telmo Miguel Martins Ribeiro"},null,null,null,null,null,"File name:",null,{"$f":"'Start Menu'!L7:Q7","v":"Tyre4BuildIns Project"},null,null,null,null,null,"Date:",null,{"$f":"'Start Menu'!T7:U7","v":"2022-06-25"}]
[null,null,null,null,null,null,null,null,"Solution B - Improved"]
[]
[null,null,null,null,null,null,null,null,"WALL CONFIGURATION"]
[]
[]
[]
[null,null,"Improved Wall (B)",null,null,null,null,null,null,null,null,null,null,null,null,"Lightweight Steel Frame (LSF)"]
[null,null,"Layer","Material 1",null,null,"λ","R","Material 2",null,null,"λ","R","Thickness",null,"Stud Spacing [mm]",null,400]
[null,"interior",null,"(Thickness) [Brand]",null,null,"[W/(m·K)]","[(m²·K)/W]","(only for non homogeneous layers)",null,null,"[W/(m·K)]","[(m²·K)/W]","[mm]",null,"Steel Structure",null,{"$f":"Calculation!CC40","v":"Steel C90/U93 (90 mm) [Pertecno]"}]
[null,null,1,"Gypsum Board (12,5 mm) [Gyptec]",null,null,{"$f":"Calculation!CP34","v":0.17499999999999999},{"$f":"Calculation!CS34","v":7.1428571428571438E-2},"---",null,null,{"$f":"Calculation!CY34","v":"---"},{"$f":"Calculation!DB34","v":"---"},{"$f":"Calculation!DE34","v":12.5},null,"Stud Thickness [mm]",null,{"$f":"Calculation!DM58*1000","v":1.5}]
[null,null,2,"OSB (12 mm) [Kronospan]",null,null,{"$f":"Calculation!CP35","v":0.13},{"$f":"Calculation!CS35","v":9.2307692307692313E-2},"---",null,null,{"$f":"Calculation!CY35","v":"---"},{"$f":"Calculation!DB35","v":"---"},{"$f":"Calculation!DE35","v":12},null,"Stud Depth [mm]",null,{"$f":"Calculation!DM57*1000","v":90}]
[null,null,3,"Air Cavity (10 mm) [ISO 6946]",null,null,{"$f":"Calculation!CP36","v":"---"},{"$f":"Calculation!CS36","v":0.15},"TB Strip XPS (10 mm) [IFoam]",null,null,{"$f":"Calculation!CY36","v":3.5000000000000003E-2},{"$f":"Calculation!DB36","v":0.2857142857142857},{"$f":"Calculation!DE36","v":10},null,"Flange Length [mm]",null,{"$f":"Calculation!DM60*1000","v":43}]
[null,null,4,"Mineral wool (90 mm) [Volcalis]",null,null,{"$f":"Calculation!CP37","v":3.5000000000000003E-2},{"$f":"Calculation!CS37","v":2.5714285714285712},"Steel C90/U93 (90 mm) [Pertecno]",null,null,{"$f":"Calculation!CY37","v":50},{"$f":"Calculation!DB37","v":1.8E-3},{"$f":"Calculation!DE37","v":90}]
[null,null,5,"Air Cavity (10 mm) [ISO 6946]",null,null,{"$f":"Calculation!CP38","v":"---"},{"$f":"Calculation!CS38","v":0.15},"TB Strip XPS (10 mm) [IFoam]",null,null,{"$f":"Calculation!CY38","v":3.5000000000000003E-2},{"$f":"Calculation!DB38","v":0.2857142857142857},{"$f":"Calculation!DE38","v":10},null,"Thermal Break Strips"]
[null,null,6,"OSB (12 mm) [Kronospan]",null,null,{"$f":"Calculation!CP39","v":0.13},{"$f":"Calculation!CS39","v":9.2307692307692313E-2},"---",null,null,{"$f":"Calculation!CY39","v":"---"},{"$f":"Calculation!DB39","v":"---"},{"$f":"Calculation!DE39","v":12},null,"Width [mm]",null,50]
[null,null,7,"Mortar (10 mm)",null,null,{"$f":"Calculation!CP40","v":1.8},{"$f":"Calculation!CS40","v":5.5555555555555558E-3},"---",null,null,{"$f":"Calculation!CY40","v":"---"},{"$f":"Calculation!DB40","v":"---"},{"$f":"Calculation!DE40","v":10}]
[null,null,8,"---",null,null,{"$f":"Calculation!CP41","v":"---"},{"$f":"Calculation!CS41","v":"---"},"---",null,null,{"$f":"Calculation!CY41","v":"---"},{"$f":"Calculation!DB41","v":"---"},{"$f":"Calculation!DE41","v":"---"},null,"Sheathing Layers"]
[null,null,9,"---",null,null,{"$f":"Calculation!CP42","v":"---"},{"$f":"Calculation!CS42","v":"---"},"---",null,null,{"$f":"Calculation!CY42","v":"---"},{"$f":"Calculation!DB42","v":"---"},{"$f":"Calculation!DE42","v":"---"},null,"Thickness [mm]",null,34.5]
[null,null,10,"---",null,null,{"$f":"Calculation!CP43","v":"---"},{"$f":"Calculation!CS43","v":"---"},"---",null,null,{"$f":"Calculation!CY43","v":"---"},{"$f":"Calculation!DB43","v":"---"},{"$f":"Calculation!DE43","v":"---"}]
[null,"exterior",null,null,null,null,null,null,null,null,null,null,"Total",{"$f":"Calculation!DE44","v":156.5}]

{"sheet":"MCA_Inp","index":6,"n_rows":26,"n_cols":20,"rows_kept":26,"cut":false,"hidden":false,"merged":[[6,19,6,20],[9,8,10,13],[13,2,13,10],[6,17,6,18],[6,11,6,16],[5,1,5,8],[6,1,6,2],[6,3,6,8],[6,9,6,10],[24,2,24,8],[14,2,14,4],[16,2,16,4],[15,2,15,4],[18,2,18,10],[21,10,23,10],[25,2,25,8],[19,2,19,8],[20,2,20,8],[21,2,21,8],[22,2,22,8],[23,2,23,8]]}
[]
[]
[]
[]
[]
[]
[null,"User name:",null,{"$f":"'Start Menu'!D7:I7","v":"Telmo Miguel Martins Ribeiro"},null,null,null,null,null,"File name:",null,{"$f":"'Start Menu'!L7:Q7","v":"Tyre4BuildIns Project"},null,null,null,null,null,"Date:",null,{"$f":"'Start Menu'!T7:U7","v":"2022-06-25"}]
[]
[]
[null,null,null,null,null,null,null,null,"MULTICRITERIA ANALYSIS"]
[]
[]
[]
[null,null,"Weights' Definition (Calculation Modules)"]
[null,null,"Final Energy Consumed",null,null,0.35,"Sum."]
[null,null,"Environmental Impacts",null,null,0.15,{"$f":"SUM(F15:F17)","v":1}]
[null,null,"Acquisition Cost",null,null,0.5,{"$f":"IF(G16=1,\"OK!\",\"KO!!!\")","v":"OK!"}]
[]
[null,null,"Weights' Definition (Environmental Indicators)"]
[null,null,"Abiotic Resources Depletion Potential - Elements (ADPE)",null,null,null,null,null,null,0.14000000000000001]
[null,null,"Abiotic Resources Depletion Potential - Fossil Resources (ADPF)",null,null,null,null,null,null,0.14000000000000001,"Sum."]
[null,null,"Acidification Potential (AP)",null,null,null,null,null,null,0.14000000000000001,{"$f":"SUM(J20:J26)","v":1}]
[null,null,"Eutrophication Potential (EP)",null,null,null,null,null,null,0.14000000000000001]
[null,null,"Photochemical Ozone Creation Potential (POCP)",null,null,null,null,null,null,0.14000000000000001]
[null,null,"Global Warming Potential (GWP)",null,null,null,null,null,null,0.16,{"$f":"IF(K22=1,\"OK!\",\"KO!!!\")","v":"OK!"}]
[null,null,"Stratospheric Ozone Layer Depletion Potential (ODP)",null,null,null,null,null,null,0.14000000000000001]

{"sheet":"Modules","index":7,"n_rows":7,"n_cols":20,"rows_kept":7,"cut":false,"hidden":false,"merged":[[6,19,6,20],[6,1,6,2],[6,3,6,8],[6,9,6,10],[6,11,6,16],[6,17,6,18]]}
[]
[]
[]
[]
[]
[]
[null,"User name:",null,{"$f":"'Start Menu'!D7:I7","v":"Telmo Miguel Martins Ribeiro"},null,null,null,null,null,"File name:",null,{"$f":"'Start Menu'!L7:Q7","v":"Tyre4BuildIns Project"},null,null,null,null,null,"Date:",null,{"$f":"'Start Menu'!T7:U7","v":"2022-06-25"}]

{"sheet":"SA_UCalc","index":8,"n_rows":27,"n_cols":20,"rows_kept":27,"cut":false,"hidden":false,"merged":[[24,18,24,19],[25,10,25,11],[26,10,26,11],[6,19,6,20],[6,1,6,2],[6,3,6,8],[6,9,6,10],[6,11,6,16],[6,17,6,18],[16,18,16,19],[17,18,17,19],[15,12,15,15],[16,12,16,15],[17,12,17,15],[11,4,11,7],[15,4,15,7],[12,4,12,7],[13,4,13,7],[14,4,14,7],[15,10,15,11],[11,8,11,9],[12,8,12,9],[13,8,13,9],[14,8,14,9],[7,8,7,13],[9,2,9,5],[14,10,14,11],[9,6,9,19],[11,10,11,11],[12,10,12,11],[13,10,13,11],[11,12,11,15],[12,12,12,15],[13,12,13,15],[14,12,14,15],[10,12,10,19],[10,4,10,11],[13,18,13,19],[10,2,11,2],[11,18,11,19],[11,16,11,17],[12,16,12,17],[13,16,13,17],[14,16,14,17],[16,4,16,7],[17,4,17,7],[18,10,18,11],[19,10,19,11],[19,12,19,15],[18,4,18,7],[19,4,19,7],[18,12,18,15],[16,10,16,11],[17,10,17,11],[16,8,16,9],[17,8,17,9],[18,8,18,9],[19,8,19,9],[32,17,32,18],[20,4,20,7],[20,10,20,11],[20,12,20,15],[20,18,20,19],[21,4,21,7],[21,10,21,11],[21,12,21,15],[21,18,21,19],[23,12,23,13],[24,12,24,13],[25,16,25,17],[26,16,26,17],[25,18,25,19],[26,18,26,19],[23,10,23,11],[24,10,24,11],[25,12,25,13],[26,12,26,13],[23,14,23,15],[24,14,24,15],[23,16,23,17],[24,16,24,17],[23,18,23,19],[24,4,24,5],[32,13,33,14],[25,2,25,3],[25,4,25,5],[26,2,26,3],[26,4,26,5],[25,14,25,15],[26,14,26,15],[25,7,26,7],[23,8,24,9],[23,2,23,5],[32,15,33,16],[24,2,24,3],[20,8,20,9],[21,8,21,9],[12,18,12,19],[14,18,14,19],[15,18,15,19],[16,16,16,17],[17,16,17,17],[18,16,18,17],[19,16,19,17],[20,16,20,17],[21,16,21,17],[18,18,18,19],[19,18,19,19],[15,8,15,9],[15,16,15,17]]}
[]
[]
[]
[]
[]
[]
[null,"User name:",null,{"$f":"'Start Menu'!D7:I7","v":"Telmo Miguel Martins Ribeiro"},null,null,null,null,null,"File name:",null,{"$f":"'Start Menu'!L7:Q7","v":"Tyre4BuildIns Project"},null,null,null,null,null,"Date:",null,{"$f":"'Start Menu'!T7:U7","v":"2022-06-25"}]
[null,null,null,null,null,null,null,null,"Solution A"]
[]
[null,null,"Element layers"]
[null,null,"Layer","d","Material 1",null,null,null,null,null,null,null,"Material 2"]
[null,"Interior",null,"[mm]","Description",null,null,null,"λ [W/(m·K)]",null,"R [(m²·K)/W]",null,"Description",null,null,null,"λ [W/(m·K)]",null,"R [(m²·K)/W]"]
[null,null,1,{"$f":"Calculation!DM32","v":12.5},{"$f":"Calculation!CM14","v":"Gypsum Board (12,5 mm) [Gyptec]"},null,null,null,{"$f":"Calculation!DN32","v":0.17499999999999999},null,{"$f":"Calculation!DR32","v":7.1428571428571438E-2},null,{"$f":"Calculation!CV14","v":"---"},null,null,null,{"$f":"Calculation!DP32","v":"---"},null,{"$f":"Calculation!DS32","v":"---"}]
[null,null,2,{"$f":"Calculation!DM33","v":12},{"$f":"Calculation!CM15","v":"OSB (12 mm) [Kronospan]"},null,null,null,{"$f":"Calculation!DN33","v":0.13},null,{"$f":"Calculation!DR33","v":9.2307692307692313E-2},null,{"$f":"Calculation!CV15","v":"---"},null,null,null,{"$f":"Calculation!DP33","v":"---"},null,{"$f":"Calculation!DS33","v":"---"}]
[null,null,3,{"$f":"Calculation!DM34","v":90},{"$f":"Calculation!CM16","v":"Mineral wool (90 mm) [Volcalis]"},null,null,null,{"$f":"Calculation!DN34","v":3.5000000000000003E-2},null,{"$f":"Calculation!DR34","v":2.5714285714285712},null,{"$f":"Calculation!CV16","v":"Steel C90/U93 (90 mm) [Pertecno]"},null,null,null,{"$f":"Calculation!DP34","v":50},null,{"$f":"Calculation!DS34","v":1.8E-3}]
[null,null,4,{"$f":"Calculation!DM35","v":12},{"$f":"Calculation!CM17","v":"OSB (12 mm) [Kronospan]"},null,null,null,{"$f":"Calculation!DN35","v":0.13},null,{"$f":"Calculation!DR35","v":9.2307692307692313E-2},null,{"$f":"Calculation!CV17","v":"---"},null,null,null,{"$f":"Calculation!DP35","v":"---"},null,{"$f":"Calculation!DS35","v":"---"}]
[null,null,5,{"$f":"Calculation!DM36","v":10},{"$f":"Calculation!CM18","v":"Mortar (10 mm)"},null,null,null,{"$f":"Calculation!DN36","v":1.8},null,{"$f":"Calculation!DR36","v":5.5555555555555558E-3},null,{"$f":"Calculation!CV18","v":"---"},null,null,null,{"$f":"Calculation!DP36","v":"---"},null,{"$f":"Calculation!DS36","v":"---"}]
[null,null,6,{"$f":"Calculation!DM37","v":"---"},{"$f":"Calculation!CM19","v":"---"},null,null,null,{"$f":"Calculation!DN37","v":"---"},null,{"$f":"Calculation!DR37","v":"---"},null,{"$f":"Calculation!CV19","v":"---"},null,null,null,{"$f":"Calculation!DP37","v":"---"},null,{"$f":"Calculation!DS37","v":"---"}]
[null,null,7,{"$f":"Calculation!DM38","v":"---"},{"$f":"Calculation!CM20","v":"---"},null,null,null,{"$f":"Calculation!DN38","v":"---"},null,{"$f":"Calculation!DR38","v":"---"},null,{"$f":"Calculation!CV20","v":"---"},null,null,null,{"$f":"Calculation!DP38","v":"---"},null,{"$f":"Calculation!DS38","v":"---"}]
[null,null,8,{"$f":"Calculation!DM39","v":"---"},{"$f":"Calculation!CM21","v":"---"},null,null,null,{"$f":"Calculation!DN39","v":"---"},null,{"$f":"Calculation!DR39","v":"---"},null,{"$f":"Calculation!CV21","v":"---"},null,null,null,{"$f":"Calculation!DP39","v":"---"},null,{"$f":"Calculation!DS39","v":"---"}]
[null,null,9,{"$f":"Calculation!DM40","v":"---"},{"$f":"Calculation!CM22","v":"---"},null,null,null,{"$f":"Calculation!DN40","v":"---"},null,{"$f":"Calculation!DR40","v":"---"},null,{"$f":"Calculation!CV22","v":"---"},null,null,null,{"$f":"Calculation!DP40","v":"---"},null,{"$f":"Calculation!DS40","v":"---"}]
[null,null,10,{"$f":"Calculation!DM41","v":"---"},{"$f":"Calculation!CM23","v":"---"},null,null,null,{"$f":"Calculation!DN41","v":"---"},null,{"$f":"Calculation!DR41","v":"---"},null,{"$f":"Calculation!CV23","v":"---"},null,null,null,{"$f":"Calculation!DP41","v":"---"},null,{"$f":"Calculation!DS41","v":"---"}]
[null,"Exterior"]
[null,null,"Surface thermal resistances",null,null,null,null,"Method","Parameter",null,"1 - ISO 6946",null,"2 - Gorgolewski",null,"3 - Gorgolewski",null,"4 - Gorgolewski",null,"5 - ASHRAE"]
[null,null,"Rsi",null,"Rse",null,null,"selection",null,null,"Combined Method",null,"Method 1",null,"Method 2",null,"Method 3",null,"Zone Method"]
[null,null,0.13,null,0.04,null,null,1,"R","[(m2K)/W]",{"$f":"Calculation!DY13","v":1.8870221520720987},null,{"$f":"Calculation!DY14","v":1.525061247172562},null,{"$f":"Calculation!DY15","v":1.3616773963823072},null,{"$f":"Calculation!DY16","v":1.3075685183169883},null,{"$f":"Calculation!DY17","v":1.455561576800291}]
[null,null,"[(m²·K)/W]",null,"[(m²·K)/W]",null,null,null,"U","[W/m2K]",{"$f":"1/K26","v":0.52993548533700119},null,{"$f":"1/M26","v":0.65571137018528491},null,{"$f":"1/O26","v":0.73438833798430625},null,{"$f":"1/Q26","v":0.76477827814876642},null,{"$f":"1/S26","v":0.68702005874479344}]

{"sheet":"SB_UCalc","index":9,"n_rows":27,"n_cols":20,"rows_kept":27,"cut":false,"hidden":false,"merged":[[12,18,12,19],[10,4,10,11],[10,12,10,19],[11,4,11,7],[11,10,11,11],[11,12,11,15],[12,4,12,7],[11,8,11,9],[12,8,12,9],[11,16,11,17],[12,16,12,17],[12,10,12,11],[12,12,12,15],[6,1,6,2],[6,3,6,8],[6,9,6,10],[6,11,6,16],[10,2,11,2],[6,17,6,18],[9,2,9,5],[9,6,9,19],[11,18,11,19],[6,19,6,20],[7,8,7,13],[13,4,13,7],[13,10,13,11],[13,12,13,15],[14,4,14,7],[14,10,14,11],[14,12,14,15],[13,8,13,9],[14,8,14,9],[24,18,24,19],[20,18,20,19],[24,10,24,11],[13,18,13,19],[14,18,14,19],[17,18,17,19],[18,18,18,19],[17,10,17,11],[23,18,23,19],[14,16,14,17],[15,16,15,17],[16,16,16,17],[17,16,17,17],[15,18,15,19],[16,18,16,19],[13,16,13,17],[15,4,15,7],[15,10,15,11],[15,12,15,15],[16,4,16,7],[16,10,16,11],[16,12,16,15],[15,8,15,9],[16,8,16,9],[21,4,21,7],[21,10,21,11],[21,12,21,15],[17,12,17,15],[17,4,17,7],[18,4,18,7],[18,10,18,11],[18,12,18,15],[18,8,18,9],[20,12,20,15],[17,8,17,9],[40,3,40,4],[25,2,25,3],[25,4,25,5],[26,2,26,3],[26,4,26,5],[19,4,19,7],[19,10,19,11],[19,12,19,15],[20,4,20,7],[20,10,20,11],[23,2,23,5],[24,2,24,3],[24,4,24,5],[23,10,23,11],[23,12,23,13],[23,14,23,15],[24,12,24,13],[25,7,26,7],[23,8,24,9],[19,8,19,9],[20,8,20,9],[21,8,21,9],[26,10,26,11],[26,12,26,13],[26,14,26,15],[26,16,26,17],[18,16,18,17],[24,16,24,17],[19,18,19,19],[21,18,21,19],[26,18,26,19],[24,14,24,15],[25,10,25,11],[25,12,25,13],[25,14,25,15],[25,16,25,17],[25,18,25,19],[20,16,20,17],[21,16,21,17],[19,16,19,17],[23,16,23,17]]}
[]
[]
[]
[]
[]
[]
[null,"User name:",null,{"$f":"'Start Menu'!D7:I7","v":"Telmo Miguel Martins Ribeiro"},null,null,null,null,null,"File name:",null,{"$f":"'Start Menu'!L7:Q7","v":"Tyre4BuildIns Project"},null,null,null,null,null,"Date:",null,{"$f":"'Start Menu'!T7:U7","v":"2022-06-25"}]
[null,null,null,null,null,null,null,null,"Solution B"]
[]
[null,null,"Element layers"]
[null,null,"Layer","d","Material 1",null,null,null,null,null,null,null,"Material 2"]
[null,"Interior",null,"[mm]","Description",null,null,null,"λ [W/(m·K)]",null,"R [(m²·K)/W]",null,"Description",null,null,null,"λ [W/(m·K)]",null,"R [(m²·K)/W]"]
[null,null,1,{"$f":"Calculation!DM77","v":12.5},{"$f":"Calculation!CM34","v":"Gypsum Board (12,5 mm) [Gyptec]"},null,null,null,{"$f":"Calculation!DN77","v":0.17499999999999999},null,{"$f":"Calculation!DR77","v":7.1428571428571438E-2},null,{"$f":"Calculation!CV34","v":"---"},null,null,null,{"$f":"Calculation!DP77","v":"---"},null,{"$f":"Calculation!DS77","v":"---"}]
[null,null,2,{"$f":"Calculation!DM78","v":12},{"$f":"Calculation!CM35","v":"OSB (12 mm) [Kronospan]"},null,null,null,{"$f":"Calculation!DN78","v":0.13},null,{"$f":"Calculation!DR78","v":9.2307692307692313E-2},null,{"$f":"Calculation!CV35","v":"---"},null,null,null,{"$f":"Calculation!DP78","v":"---"},null,{"$f":"Calculation!DS78","v":"---"}]
[null,null,3,{"$f":"Calculation!DM79","v":10},{"$f":"Calculation!CM36","v":"Air Cavity (10 mm) [ISO 6946]"},null,null,null,{"$f":"Calculation!DN79","v":"---"},null,{"$f":"Calculation!DR79","v":0.15},null,{"$f":"Calculation!CV36","v":"TB Strip XPS (10 mm) [IFoam]"},null,null,null,{"$f":"Calculation!DP79","v":3.5000000000000003E-2},null,{"$f":"Calculation!DS79","v":0.2857142857142857}]
[null,null,4,{"$f":"Calculation!DM80","v":90},{"$f":"Calculation!CM37","v":"Mineral wool (90 mm) [Volcalis]"},null,null,null,{"$f":"Calculation!DN80","v":3.5000000000000003E-2},null,{"$f":"Calculation!DR80","v":2.5714285714285712},null,{"$f":"Calculation!CV37","v":"Steel C90/U93 (90 mm) [Pertecno]"},null,null,null,{"$f":"Calculation!DP80","v":50},null,{"$f":"Calculation!DS80","v":1.8E-3}]
[null,null,5,{"$f":"Calculation!DM81","v":10},{"$f":"Calculation!CM38","v":"Air Cavity (10 mm) [ISO 6946]"},null,null,null,{"$f":"Calculation!DN81","v":"---"},null,{"$f":"Calculation!DR81","v":0.15},null,{"$f":"Calculation!CV38","v":"TB Strip XPS (10 mm) [IFoam]"},null,null,null,{"$f":"Calculation!DP81","v":3.5000000000000003E-2},null,{"$f":"Calculation!DS81","v":0.2857142857142857}]
[null,null,6,{"$f":"Calculation!DM82","v":12},{"$f":"Calculation!CM39","v":"OSB (12 mm) [Kronospan]"},null,null,null,{"$f":"Calculation!DN82","v":0.13},null,{"$f":"Calculation!DR82","v":9.2307692307692313E-2},null,{"$f":"Calculation!CV39","v":"---"},null,null,null,{"$f":"Calculation!DP82","v":"---"},null,{"$f":"Calculation!DS82","v":"---"}]
[null,null,7,{"$f":"Calculation!DM83","v":10},{"$f":"Calculation!CM40","v":"Mortar (10 mm)"},null,null,null,{"$f":"Calculation!DN83","v":1.8},null,{"$f":"Calculation!DR83","v":5.5555555555555558E-3},null,{"$f":"Calculation!CV40","v":"---"},null,null,null,{"$f":"Calculation!DP83","v":"---"},null,{"$f":"Calculation!DS83","v":"---"}]
[null,null,8,{"$f":"Calculation!DM84","v":"---"},{"$f":"Calculation!CM41","v":"---"},null,null,null,{"$f":"Calculation!DN84","v":"---"},null,{"$f":"Calculation!DR84","v":"---"},null,{"$f":"Calculation!CV41","v":"---"},null,null,null,{"$f":"Calculation!DP84","v":"---"},null,{"$f":"Calculation!DS84","v":"---"}]
[null,null,9,{"$f":"Calculation!DM85","v":"---"},{"$f":"Calculation!CM42","v":"---"},null,null,null,{"$f":"Calculation!DN85","v":"---"},null,{"$f":"Calculation!DR85","v":"---"},null,{"$f":"Calculation!CV42","v":"---"},null,null,null,{"$f":"Calculation!DP85","v":"---"},null,{"$f":"Calculation!DS85","v":"---"}]
[null,null,10,{"$f":"Calculation!DM86","v":"---"},{"$f":"Calculation!CM43","v":"---"},null,null,null,{"$f":"Calculation!DN86","v":"---"},null,{"$f":"Calculation!DR86","v":"---"},null,{"$f":"Calculation!CV43","v":"---"},null,null,null,{"$f":"Calculation!DP86","v":"---"},null,{"$f":"Calculation!DS86","v":"---"}]
[null,"Exterior"]
[null,null,"Surface thermal resistances",null,null,null,null,"Method","Parameter",null,"1 - ISO 6946",null,"2 - Gorgolewski",null,"3 - Gorgolewski",null,"4 - Gorgolewski",null,"5 - ASHRAE"]
[null,null,"Rsi",null,"Rse",null,null,"selection",null,null,"Combined Method",null,"Method 1",null,"Method 2",null,"Method 3",null,"Zone Method"]
[null,null,0.13,null,0.04,null,null,{"$f":"SA_UCalc!H26","v":1},"R","[(m2K)/W]",{"$f":"Calculation!DY58","v":2.2151044840648018},null,{"$f":"Calculation!DY59","v":1.9654252953941462},null,{"$f":"Calculation!DY60","v":1.6851870009168648},null,{"$f":"Calculation!DY61","v":1.7460394573709002},null,{"$f":"Calculation!DY62","v":1.9427902478862875}]
[null,null,"[(m²·K)/W]",null,"[(m²·K)/W]",null,null,null,"U","[W/m2K]",{"$f":"1/K26","v":0.45144597340390985},null,{"$f":"1/M26","v":0.50879573105293741},null,{"$f":"1/O26","v":0.59340595403117102},null,{"$f":"1/Q26","v":0.57272474329174128},null,{"$f":"1/S26","v":0.51472360492234182}]

{"sheet":"Energy","index":10,"n_rows":26,"n_cols":20,"rows_kept":26,"cut":false,"hidden":false,"merged":[[25,13,25,16],[22,14,22,15],[22,16,22,17],[23,12,23,13],[24,12,24,13],[25,17,25,18],[21,14,21,17],[21,18,22,19],[6,19,6,20],[9,2,9,5],[6,1,6,2],[6,3,6,8],[6,9,6,10],[6,11,6,16],[6,17,6,18],[10,12,10,19],[15,12,15,19],[11,8,12,9],[11,7,12,7],[11,10,12,10],[13,7,14,7],[13,10,14,10],[10,5,10,7],[15,5,16,7],[15,8,16,10],[10,8,10,10],[10,2,10,4],[11,5,12,6],[13,5,14,6],[11,2,12,4],[13,2,14,4],[15,2,16,4],[20,12,20,19],[11,18,12,19],[16,18,17,19],[17,14,17,15],[17,16,17,17],[12,14,12,15],[14,12,14,13],[13,12,13,13],[12,16,12,17],[11,14,11,17],[16,14,16,17],[18,12,18,13],[19,12,19,13],[17,2,18,4],[25,5,26,7],[9,15,9,16],[17,8,18,9],[23,2,24,4],[25,2,26,4],[13,8,14,9],[19,2,19,4],[20,2,20,4],[21,2,21,4],[22,2,22,4],[19,10,20,10],[21,10,22,10],[23,5,24,7],[23,8,24,10],[17,7,18,7],[25,8,26,10],[21,8,22,9],[17,5,18,6],[19,5,20,6],[21,5,22,6],[19,7,20,7],[21,7,22,7],[19,8,20,9],[17,10,18,10]]}
[]
[]
[]
[]
[]
[]
[null,"User name:",null,{"$f":"'Start Menu'!D7:I7","v":"Telmo Miguel Martins Ribeiro"},null,null,null,null,null,"File name:",null,{"$f":"'Start Menu'!L7:Q7","v":"Tyre4BuildIns Project"},null,null,null,null,null,"Date:",null,{"$f":"'Start Menu'!T7:U7","v":"2022-06-25"}]
[]
[]
[null,null,"Parameters",null,null,null,null,null,null,null,null,null,null,null,null,"Annual Balance"]
[null,null,null,null,null,"Solution A",null,null,"Solution B",null,null,null,"Heating"]
[null,null,"U-Value",null,null,{"$f":"Calculation!GD51","v":0.52993548533700119},null,"W/(m²·K)",{"$f":"Calculation!GG51","v":0.45144597340390985},null,"W/(m²·K)",null,null,null,"Final Energy",null,null,null,"Energy Saved"]
[null,null,null,null,null,null,null,null,null,null,null,null,null,null,"Solution A",null,"Solution B"]
[null,null,"External Walls Area",null,null,{"$f":"Calculation!GD52","v":239.76000000000005},null,"m²",{"$f":"Calculation!GG52","v":239.76000000000005},null,"m²",null,"Per unit area",null,{"$f":"Calculation!GD59","v":4.7676024463689979},"kWh/m2",{"$f":"Calculation!GG59","v":4.0614659458692319},"kWh/m2",{"$f":"Calculation!GJ59","v":0.70613650049976595},"kWh/m2"]
[null,null,null,null,null,null,null,null,null,null,null,null,"Total",null,{"$f":"Calculation!GD60","v":1143.0803625414312},"kWh",{"$f":"Calculation!GG60","v":973.77707518160719},"kWh",{"$f":"Calculation!GJ60","v":169.30328735982403},"kWh"]
[null,null,"Localization",null,null,{"$f":"Calculation!GD53","v":"Coimbra"},null,null,{"$f":"Calculation!GG53","v":"Coimbra"},null,null,null,"Cooling"]
[null,null,null,null,null,null,null,null,null,null,null,null,null,null,"Final Energy",null,null,null,"Energy Saved"]
[null,null,"Altitude",null,null,{"$f":"Calculation!GD54","v":75},null,"m",{"$f":"Calculation!GG54","v":75},null,"m",null,null,null,"Solution A",null,"Solution B"]
[null,null,null,null,null,null,null,null,null,null,null,null,"Per unit area",null,{"$f":"Calculation!GD61","v":1.8176484326781814},"kWh/m2",{"$f":"Calculation!GG61","v":1.5484338918626452},"kWh/m2",{"$f":"Calculation!GJ61","v":0.2692145408155362},"kWh/m2"]
[null,null,"Heating Degrees Days",null,null,{"$f":"Calculation!GD55","v":1312},null,"˚C",{"$f":"Calculation!GG55","v":1312},null,"˚C",null,"Total",null,{"$f":"Calculation!GD62","v":435.79938821892085},"kWh",{"$f":"Calculation!GG62","v":371.25250991298788},"kWh",{"$f":"Calculation!GJ62","v":64.546878305932978},"kWh"]
[null,null,"(Ref. Temperature: 18 ˚C)",null,null,null,null,null,null,null,null,null,"Total"]
[null,null,"Cooling Degrees Days",null,null,{"$f":"Calculation!GD56","v":500.20000000000022},null,"˚C",{"$f":"Calculation!GG56","v":500.20000000000022},null,"˚C",null,null,null,"Final Energy",null,null,null,"Energy Saved"]
[null,null,"(Ref. Temperature: 25 ˚C)",null,null,null,null,null,null,null,null,null,null,null,"Solution A",null,"Solution B"]
[null,null,"CoP",null,null,{"$f":"Calculation!GD57","v":3.5},null,null,{"$f":"Calculation!GG57","v":3.5},null,null,null,"Per unit area",null,{"$f":"Calculation!GD63","v":6.5852508790471793},"kWh/m2",{"$f":"Calculation!GG63","v":5.6098998377318772},"kWh/m2",{"$f":"Calculation!GJ63","v":0.97535104131530215},"kWh/m2"]
[null,null,null,null,null,null,null,null,null,null,null,null,"Total",null,{"$f":"Calculation!GD64","v":1578.8797507603522},"kWh",{"$f":"Calculation!GG64","v":1345.0295850945949},"kWh",{"$f":"Calculation!GJ64","v":233.85016566575723},"kWh"]
[null,null,"EER",null,null,{"$f":"Calculation!GD58","v":3.5},null,null,{"$f":"Calculation!GG58","v":3.5},null,null,null,null,"Percentage of Saved Energy",null,null,null,{"$f":"Calculation!GM64","v":0.14811144772307094}]

{"sheet":"SA_LCA","index":11,"n_rows":27,"n_cols":20,"rows_kept":27,"cut":false,"hidden":false,"merged":[[17,8,17,9],[18,8,18,9],[19,8,19,9],[20,8,20,9],[21,8,21,9],[23,2,23,3],[12,12,12,19],[13,12,13,15],[13,18,13,19],[13,10,13,11],[21,12,21,15],[22,12,22,15],[23,12,23,15],[14,10,23,11],[14,12,14,15],[15,12,15,15],[16,12,16,15],[17,12,17,15],[18,12,18,15],[19,12,19,15],[20,12,20,15],[18,2,18,3],[19,2,19,3],[20,2,20,3],[21,2,21,3],[22,2,22,3],[12,2,13,3],[13,8,13,9],[13,16,13,17],[6,17,6,18],[6,19,6,20],[9,2,9,6],[7,8,7,13],[9,7,9,12],[9,16,9,18],[6,1,6,2],[6,3,6,8],[6,9,6,10],[6,11,6,16],[11,2,11,10],[12,4,12,11],[13,4,13,7],[26,12,26,14],[25,2,25,10],[14,4,14,7],[15,4,15,7],[16,4,16,7],[17,4,17,7],[18,4,18,7],[19,4,19,7],[20,4,20,7],[21,4,21,7],[22,4,22,7],[23,4,23,7],[14,2,14,3],[15,2,15,3],[16,2,16,3],[17,2,17,3],[22,8,22,9],[23,8,23,9],[14,18,23,19],[14,16,14,17],[15,16,15,17],[16,16,16,17],[17,16,17,17],[18,16,18,17],[19,16,19,17],[20,16,20,17],[21,16,21,17],[22,16,22,17],[23,16,23,17],[14,8,14,9],[15,8,15,9],[16,8,16,9]]}
[]
[]
[]
[]
[]
[]
[null,"User name:",null,{"$f":"'Start Menu'!D7:I7","v":"Telmo Miguel Martins Ribeiro"},null,null,null,null,null,"File name:",null,{"$f":"'Start Menu'!L7:Q7","v":"Tyre4BuildIns Project"},null,null,null,null,null,"Date:",null,{"$f":"'Start Menu'!T7:U7","v":"2022-06-25"}]
[null,null,null,null,null,null,null,null,"Solution A"]
[]
[null,null,"Environmental Performance Indicator",null,null,null,null,"Photochemical Ozone Creation Potential (POCP)",null,null,null,null,null,null,null,null,"Life Cycle Stages",null,null,"A1+A2+A3"]
[]
[null,null,"Environmental Performance of the Improved Wall Materials (per functional unit)"]
[null,"Interior","Layer",null,"Material 1",null,null,null,null,null,null,null,"Material 2"]
[null,null,null,null,"Description",null,null,null,"Indicator value",null,"Unit",null,"Description",null,null,null,"Indicator value",null,"Unit"]
[null,null,1,null,{"$f":"Calculation!GU66","v":"Gypsum Board (12,5 mm) [Gyptec]"},null,null,null,{"$f":"Calculation!GX66","v":9.3999999999999997E-4},null,{"$f":"Calculation!HA66","v":"kg C2H4-eq"},null,{"$f":"Calculation!GU77","v":"---"},null,null,null,{"$f":"Calculation!GX77","v":"---"},null,{"$f":"Calculation!HA77","v":"kg C2H4-eq"}]
[null,null,2,null,{"$f":"Calculation!GU67","v":"OSB (12 mm) [Kronospan]"},null,null,null,{"$f":"Calculation!GX67","v":6.2640000000000005E-3},null,null,null,{"$f":"Calculation!GU78","v":"---"},null,null,null,{"$f":"Calculation!GX78","v":"---"}]
[null,null,3,null,{"$f":"Calculation!GU68","v":"Mineral wool (90 mm) [Volcalis]"},null,null,null,{"$f":"Calculation!GX68","v":6.4619999999999999E-4},null,null,null,{"$f":"Calculation!GU79","v":"Steel C90/U93 (90 mm) [Pertecno]"},null,null,null,{"$f":"Calculation!GX79","v":4.6603460000000003E-4}]
[null,null,4,null,{"$f":"Calculation!GU69","v":"OSB (12 mm) [Kronospan]"},null,null,null,{"$f":"Calculation!GX69","v":6.2640000000000005E-3},null,null,null,{"$f":"Calculation!GU80","v":"---"},null,null,null,{"$f":"Calculation!GX80","v":"---"}]
[null,null,5,null,{"$f":"Calculation!GU70","v":"Mortar (10 mm)"},null,null,null,{"$f":"Calculation!GX70","v":2.4499999999999999E-4},null,null,null,{"$f":"Calculation!GU81","v":"---"},null,null,null,{"$f":"Calculation!GX81","v":"---"}]
[null,null,6,null,{"$f":"Calculation!GU71","v":"---"},null,null,null,{"$f":"Calculation!GX71","v":"---"},null,null,null,{"$f":"Calculation!GU82","v":"---"},null,null,null,{"$f":"Calculation!GX82","v":"---"}]
[null,null,7,null,{"$f":"Calculation!GU72","v":"---"},null,null,null,{"$f":"Calculation!GX72","v":"---"},null,null,null,{"$f":"Calculation!GU83","v":"---"},null,null,null,{"$f":"Calculation!GX83","v":"---"}]
[null,null,8,null,{"$f":"Calculation!GU73","v":"---"},null,null,null,{"$f":"Calculation!GX73","v":"---"},null,null,null,{"$f":"Calculation!GU84","v":"---"},null,null,null,{"$f":"Calculation!GX84","v":"---"}]
[null,null,9,null,{"$f":"Calculation!GU74","v":"---"},null,null,null,{"$f":"Calculation!GX74","v":"---"},null,null,null,{"$f":"Calculation!GU85","v":"---"},null,null,null,{"$f":"Calculation!GX85","v":"---"}]
[null,"Exterior",10,null,{"$f":"Calculation!GU75","v":"---"},null,null,null,{"$f":"Calculation!GX75","v":"---"},null,null,null,{"$f":"Calculation!GU86","v":"---"},null,null,null,{"$f":"Calculation!GX86","v":"---"}]
[]
[null,null,"Environmental Performance of the Wall (functional unit - 1 m2 of wall)"]
[null,null,{"$f":"H10","v":"Photochemical Ozone Creation Potential (POCP)"},null,null,null,null,null,null,null,null,{"$f":"Calculation!GX87","v":1.4825234600000001E-2},{"$f":"K15","v":"kg C2H4-eq"}]

{"sheet":"SB_LCA","index":12,"n_rows":27,"n_cols":20,"rows_kept":27,"cut":false,"hidden":false,"merged":[[14,18,23,19],[19,8,19,9],[20,8,20,9],[21,8,21,9],[26,12,26,14],[14,12,14,15],[19,12,19,15],[14,16,14,17],[15,16,15,17],[16,16,16,17],[17,16,17,17],[18,16,18,17],[19,16,19,17],[20,16,20,17],[21,16,21,17],[22,16,22,17],[25,2,25,10],[21,12,21,15],[22,8,22,9],[23,8,23,9],[22,2,22,3],[22,4,22,7],[22,12,22,15],[23,2,23,3],[23,4,23,7],[23,12,23,15],[14,2,14,3],[14,4,14,7],[18,2,18,3],[18,4,18,7],[18,12,18,15],[16,12,16,15],[17,2,17,3],[17,4,17,7],[17,12,17,15],[17,8,17,9],[18,8,18,9],[15,2,15,3],[15,4,15,7],[15,12,15,15],[19,2,19,3],[19,4,19,7],[21,2,21,3],[21,4,21,7],[16,2,16,3],[16,4,16,7],[20,2,20,3],[20,4,20,7],[11,2,11,10],[12,2,13,3],[12,4,12,11],[12,12,12,19],[13,4,13,7],[13,8,13,9],[13,10,13,11],[13,12,13,15],[13,16,13,17],[13,18,13,19],[6,19,6,20],[7,8,7,13],[9,2,9,6],[6,1,6,2],[6,3,6,8],[6,9,6,10],[6,11,6,16],[6,17,6,18],[9,7,9,12],[9,16,9,18],[23,16,23,17],[14,10,23,11],[14,8,14,9],[15,8,15,9],[16,8,16,9],[20,12,20,15]]}
[]
[]
[]
[]
[]
[]
[null,"User name:",null,{"$f":"'Start Menu'!D7:I7","v":"Telmo Miguel Martins Ribeiro"},null,null,null,null,null,"File name:",null,{"$f":"'Start Menu'!L7:Q7","v":"Tyre4BuildIns Project"},null,null,null,null,null,"Date:",null,{"$f":"'Start Menu'!T7:U7","v":"2022-06-25"}]
[null,null,null,null,null,null,null,null,"Solution B"]
[]
[null,null,"Environmental Performance Indicator",null,null,null,null,"Global Warming Potential (GWP)",null,null,null,null,null,null,null,null,"Life Cycle Stages",null,null,"A1+A2+A3"]
[]
[null,null,"Environmental Performance of the Improved Wall Materials (per functional unit)"]
[null,"Interior","Layer",null,"Material 1",null,null,null,null,null,null,null,"Material 2"]
[null,null,null,null,"Description",null,null,null,"Indicator value",null,"Unit",null,"Description",null,null,null,"Indicator value",null,"Unit"]
[null,null,1,null,{"$f":"Calculation!GU94","v":"Gypsum Board (12,5 mm) [Gyptec]"},null,null,null,{"$f":"Calculation!GX94","v":2.5},null,{"$f":"Calculation!HA94","v":"kg CO2-eq"},null,{"$f":"Calculation!GU105","v":"---"},null,null,null,{"$f":"Calculation!GX105","v":"---"},null,{"$f":"Calculation!HA105","v":"kg CO2-eq"}]
[null,null,2,null,{"$f":"Calculation!GU95","v":"OSB (12 mm) [Kronospan]"},null,null,null,{"$f":"Calculation!GX95","v":-9.0359999999999996},null,null,null,{"$f":"Calculation!GU106","v":"---"},null,null,null,{"$f":"Calculation!GX106","v":"---"}]
[null,null,3,null,{"$f":"Calculation!GU96","v":"Air Cavity (10 mm) [ISO 6946]"},null,null,null,{"$f":"Calculation!GX96","v":0},null,null,null,{"$f":"Calculation!GU107","v":"TB Strip XPS (10 mm) [IFoam]"},null,null,null,{"$f":"Calculation!GX107","v":0.75588235294117645}]
[null,null,4,null,{"$f":"Calculation!GU97","v":"Mineral wool (90 mm) [Volcalis]"},null,null,null,{"$f":"Calculation!GX97","v":1.5209999999999999},null,null,null,{"$f":"Calculation!GU108","v":"Steel C90/U93 (90 mm) [Pertecno]"},null,null,null,{"$f":"Calculation!GX108","v":5.5312800000000013E-3}]
[null,null,5,null,{"$f":"Calculation!GU98","v":"Air Cavity (10 mm) [ISO 6946]"},null,null,null,{"$f":"Calculation!GX98","v":0},null,null,null,{"$f":"Calculation!GU109","v":"TB Strip XPS (10 mm) [IFoam]"},null,null,null,{"$f":"Calculation!GX109","v":0.75588235294117645}]
[null,null,6,null,{"$f":"Calculation!GU99","v":"OSB (12 mm) [Kronospan]"},null,null,null,{"$f":"Calculation!GX99","v":-9.0359999999999996},null,null,null,{"$f":"Calculation!GU110","v":"---"},null,null,null,{"$f":"Calculation!GX110","v":"---"}]
[null,null,7,null,{"$f":"Calculation!GU100","v":"Mortar (10 mm)"},null,null,null,{"$f":"Calculation!GX100","v":1.42},null,null,null,{"$f":"Calculation!GU111","v":"---"},null,null,null,{"$f":"Calculation!GX111","v":"---"}]
[null,null,8,null,{"$f":"Calculation!GU101","v":"---"},null,null,null,{"$f":"Calculation!GX101","v":"---"},null,null,null,{"$f":"Calculation!GU112","v":"---"},null,null,null,{"$f":"Calculation!GX112","v":"---"}]
[null,null,9,null,{"$f":"Calculation!GU102","v":"---"},null,null,null,{"$f":"Calculation!GX102","v":"---"},null,null,null,{"$f":"Calculation!GU113","v":"---"},null,null,null,{"$f":"Calculation!GX113","v":"---"}]
[null,"Exterior",10,null,{"$f":"Calculation!GU103","v":"---"},null,null,null,{"$f":"Calculation!GX103","v":"---"},null,null,null,{"$f":"Calculation!GU114","v":"---"},null,null,null,{"$f":"Calculation!GX114","v":"---"}]
[]
[null,null,"Environmental Performance of the Wall (functional unit - 1 m2 of wall)"]
[null,null,{"$f":"H10","v":"Global Warming Potential (GWP)"},null,null,null,null,null,null,null,null,{"$f":"Calculation!GX115","v":-11.113704014117646},{"$f":"K15","v":"kg CO2-eq"}]

{"sheet":"Comp_LCA","index":13,"n_rows":27,"n_cols":20,"rows_kept":27,"cut":false,"hidden":false,"merged":[[6,17,6,18],[6,19,6,20],[33,2,33,6],[6,1,6,2],[6,3,6,8],[6,9,6,10],[6,11,6,16],[13,3,17,4],[19,3,23,4],[7,8,7,13],[9,2,9,6],[9,7,9,12],[9,16,9,18],[22,9,23,9],[16,5,16,8],[22,5,22,8],[34,7,34,10],[26,14,26,16],[13,10,14,10],[16,10,17,10],[22,10,23,10],[19,10,20,10],[13,5,14,8],[19,5,20,8],[16,9,17,9],[13,9,14,9],[19,9,20,9],[34,2,34,6],[23,5,23,8],[17,5,17,8]]}
[]
[]
[]
[]
[]
[]
[null,"User name:",null,{"$f":"'Start Menu'!D7:I7","v":"Telmo Miguel Martins Ribeiro"},null,null,null,null,null,"File name:",null,{"$f":"'Start Menu'!L7:Q7","v":"Tyre4BuildIns Project"},null,null,null,null,null,"Date:",null,{"$f":"'Start Menu'!T7:U7","v":"2022-06-25"}]
[null,null,null,null,null,null,null,null,"Comparison"]
[]
[null,null,"Environmental Performance Indicator",null,null,null,null,"Photochemical Ozone Creation Potential (POCP)",null,null,null,null,null,null,null,null,"Life Cycle Stages",null,null,"A1+A2+A3"]
[]
[]
[]
[null,null,null,"Solution A",null,"Total",null,null,null,{"$f":"Calculation!GX144","v":1.4825234600000001E-2},{"$f":"Calculation!HA123","v":"kg C2H4-eq"}]
[]
[]
[null,null,null,null,null,"Wall component",null,null,null,{"$f":"Calculation!HU123","v":6.2640000000000005E-3},{"$f":"Calculation!HA123","v":"kg C2H4-eq"}]
[null,null,null,null,null,"OSB (12 mm) [Kronospan]",null,null,null,{"$f":"IF(VLOOKUP($H$10,Comp_LCA!$D$65:$K$87,8)=1,VLOOKUP(F18,Calculation!$D$9:$L$50,30),IF(VLOOKUP($H$10,Comp_LCA!$D$65:$K$87,8)=2,VLOOKUP(F18,Calculation!$D$9:$L$50,32),IF(VLOOKUP($H$10,Comp_LCA!$D$65:$K$87,8)=3,VLOOKUP(F18,Calculation!$D$9:$L$50,22),IF(VLOOKUP($H$10,Comp_LCA!$D$65:$K$87,8)=4,VLOOKUP(F18,Calculation!$D$9:$L$50,24),IF(VLOOKUP($H$10,Comp_LCA!$D$65:$K$87,8)=5,VLOOKUP(F18,Calculation!$D$9:$L$50,28),IF(VLOOKUP($H$10,Comp_LCA!$D$65:$K$87,8)=6,VLOOKUP(F18,Calculation!$D$9:$L$50,20),IF(VLOOKUP($H$10,Comp_LCA!$D$65:$K$87,8)=7,VLOOKUP(F18,Calculation!$D$9:$L$50,26),0)))))))","v":{"$error":"#N/A"}}]
[]
[null,null,null,"Solution B",null,"Total",null,null,null,{"$f":"Calculation!GX172","v":1.5195822835294118E-2},{"$f":"Calculation!HA151","v":"kg C2H4-eq"}]
[]
[]
[null,null,null,null,null,"Wall component",null,null,null,{"$f":"Calculation!HU151","v":6.2640000000000005E-3},{"$f":"Calculation!HA162","v":"kg C2H4-eq"}]
[null,null,null,null,null,"OSB (12 mm) [Kronospan]",null,null,null,{"$f":"IF(VLOOKUP($H$10,Comp_LCA!$D$65:$K$87,8)=1,VLOOKUP(F24,Calculation!$D$9:$L$50,30),IF(VLOOKUP($H$10,Comp_LCA!$D$65:$K$87,8)=2,VLOOKUP(F24,Calculation!$D$9:$L$50,32),IF(VLOOKUP($H$10,Comp_LCA!$D$65:$K$87,8)=3,VLOOKUP(F24,Calculation!$D$9:$L$50,22),IF(VLOOKUP($H$10,Comp_LCA!$D$65:$K$87,8)=4,VLOOKUP(F24,Calculation!$D$9:$L$50,24),IF(VLOOKUP($H$10,Comp_LCA!$D$65:$K$87,8)=5,VLOOKUP(F24,Calculation!$D$9:$L$50,28),IF(VLOOKUP($H$10,Comp_LCA!$D$65:$K$87,8)=6,VLOOKUP(F24,Calculation!$D$9:$L$50,20),IF(VLOOKUP($H$10,Comp_LCA!$D$65:$K$87,8)=7,VLOOKUP(F24,Calculation!$D$9:$L$50,26),0)))))))","v":{"$error":"#N/A"}}]
[]
[]
[null,null,null,null,null,null,null,null,null,null,null,null,null,null,{"$f":"K14","v":"kg C2H4-eq"}]

{"sheet":"SA_CostBen","index":14,"n_rows":26,"n_cols":20,"rows_kept":26,"cut":false,"hidden":false,"merged":[[11,18,11,19],[10,4,10,11],[10,12,10,19],[11,4,11,7],[11,12,11,15],[11,8,11,9],[11,10,11,11],[11,16,11,17],[25,2,26,3],[25,4,26,4],[25,5,26,6],[25,7,26,7],[16,12,16,15],[17,12,17,15],[23,2,23,10],[24,2,24,4],[24,5,24,7],[21,2,21,3],[20,2,20,3],[20,4,20,7],[21,4,21,7],[20,12,20,15],[21,12,21,15],[19,2,19,3],[15,2,15,3],[12,12,12,15],[13,12,13,15],[14,12,14,15],[15,12,15,15],[18,2,18,3],[18,4,18,7],[19,4,19,7],[18,12,18,15],[19,12,19,15],[17,2,17,3],[16,2,16,3],[6,19,6,20],[9,2,9,10],[6,17,6,18],[12,4,12,7],[13,4,13,7],[14,4,14,7],[15,4,15,7],[16,4,16,7],[17,4,17,7],[12,2,12,3],[13,2,13,3],[14,2,14,3],[7,8,7,13],[10,2,11,3],[5,1,5,8],[6,1,6,2],[6,3,6,8],[6,9,6,10],[6,11,6,16]]}
[]
[]
[]
[]
[]
[]
[null,"User name:",null,{"$f":"'Start Menu'!D7:I7","v":"Telmo Miguel Martins Ribeiro"},null,null,null,null,null,"File name:",null,{"$f":"'Start Menu'!L7:Q7","v":"Tyre4BuildIns Project"},null,null,null,null,null,"Date:",null,{"$f":"'Start Menu'!T7:U7","v":"2022-06-25"}]
[null,null,null,null,null,null,null,null,"Solution A"]
[]
[null,null,"Cost of the Reference Wall Materials"]
[null,null,"Layer",null,"Material 1",null,null,null,null,null,null,null,"Material 2"]
[null,"Interior",null,null,"Description",null,null,null,"Unit cost",null,"Unit consumption",null,"Description",null,null,null,"Unit cost",null,"Unit consumption"]
[null,null,1,null,{"$f":"Calculation!IY11","v":"Gypsum Board (12,5 mm) [Gyptec]"},null,null,null,{"$f":"Calculation!JB11","v":3.25},{"$f":"Calculation!JE11","v":"€/m²"},{"$f":"Calculation!JH11","v":1},{"$f":"Calculation!JK11","v":"m²/m²"},{"$f":"Calculation!JN11","v":"---"},null,null,null,{"$f":"Calculation!JQ11","v":"---"},{"$f":"Calculation!JT11","v":"---"},{"$f":"Calculation!JW11","v":"---"},{"$f":"Calculation!JZ11","v":"---"}]
[null,null,2,null,{"$f":"Calculation!IY12","v":"OSB (12 mm) [Kronospan]"},null,null,null,{"$f":"Calculation!JB12","v":7.32},{"$f":"Calculation!JE12","v":"€/m²"},{"$f":"Calculation!JH12","v":1},{"$f":"Calculation!JK12","v":"m²/m²"},{"$f":"Calculation!JN12","v":"---"},null,null,null,{"$f":"Calculation!JQ12","v":"---"},{"$f":"Calculation!JT12","v":"---"},{"$f":"Calculation!JW12","v":"---"},{"$f":"Calculation!JZ12","v":"---"}]
[null,null,3,null,{"$f":"Calculation!IY13","v":"Mineral wool (90 mm) [Volcalis]"},null,null,null,{"$f":"Calculation!JB13","v":2.9160000000000004},{"$f":"Calculation!JE13","v":"€/m²"},{"$f":"Calculation!JH13","v":1},{"$f":"Calculation!JK13","v":"m²/m²"},{"$f":"Calculation!JN13","v":"Steel C90/U93 (90 mm) [Pertecno]"},null,null,null,{"$f":"Calculation!JQ13","v":6.2348200000000009},{"$f":"Calculation!JT13","v":"€/m"},{"$f":"Calculation!JW13","v":3.3074074074074078},{"$f":"Calculation!JZ13","v":"m/m²"}]
[null,null,4,null,{"$f":"Calculation!IY14","v":"OSB (12 mm) [Kronospan]"},null,null,null,{"$f":"Calculation!JB14","v":7.32},{"$f":"Calculation!JE14","v":"€/m²"},{"$f":"Calculation!JH14","v":1},{"$f":"Calculation!JK14","v":"m²/m²"},{"$f":"Calculation!JN14","v":"---"},null,null,null,{"$f":"Calculation!JQ14","v":"---"},{"$f":"Calculation!JT14","v":"---"},{"$f":"Calculation!JW14","v":"---"},{"$f":"Calculation!JZ14","v":"---"}]
[null,null,5,null,{"$f":"Calculation!IY15","v":"Mortar (10 mm)"},null,null,null,{"$f":"Calculation!JB15","v":2.44},{"$f":"Calculation!JE15","v":"€/m²"},{"$f":"Calculation!JH15","v":1},{"$f":"Calculation!JK15","v":"m²/m²"},{"$f":"Calculation!JN15","v":"---"},null,null,null,{"$f":"Calculation!JQ15","v":"---"},{"$f":"Calculation!JT15","v":"---"},{"$f":"Calculation!JW15","v":"---"},{"$f":"Calculation!JZ15","v":"---"}]
[null,null,6,null,{"$f":"Calculation!IY16","v":"---"},null,null,null,{"$f":"Calculation!JB16","v":"---"},{"$f":"Calculation!JE16","v":"---"},{"$f":"Calculation!JH16","v":"---"},{"$f":"Calculation!JK16","v":"---"},{"$f":"Calculation!JN16","v":"---"},null,null,null,{"$f":"Calculation!JQ16","v":"---"},{"$f":"Calculation!JT16","v":"---"},{"$f":"Calculation!JW16","v":"---"},{"$f":"Calculation!JZ16","v":"---"}]
[null,null,7,null,{"$f":"Calculation!IY17","v":"---"},null,null,null,{"$f":"Calculation!JB17","v":"---"},{"$f":"Calculation!JE17","v":"---"},{"$f":"Calculation!JH17","v":"---"},{"$f":"Calculation!JK17","v":"---"},{"$f":"Calculation!JN17","v":"---"},null,null,null,{"$f":"Calculation!JQ17","v":"---"},{"$f":"Calculation!JT17","v":"---"},{"$f":"Calculation!JW17","v":"---"},{"$f":"Calculation!JZ17","v":"---"}]
[null,null,8,null,{"$f":"Calculation!IY18","v":"---"},null,null,null,{"$f":"Calculation!JB18","v":"---"},{"$f":"Calculation!JE18","v":"---"},{"$f":"Calculation!JH18","v":"---"},{"$f":"Calculation!JK18","v":"---"},{"$f":"Calculation!JN18","v":"---"},null,null,null,{"$f":"Calculation!JQ18","v":"---"},{"$f":"Calculation!JT18","v":"---"},{"$f":"Calculation!JW18","v":"---"},{"$f":"Calculation!JZ18","v":"---"}]
[null,null,9,null,{"$f":"Calculation!IY19","v":"---"},null,null,null,{"$f":"Calculation!JB19","v":"---"},{"$f":"Calculation!JE19","v":"---"},{"$f":"Calculation!JH19","v":"---"},{"$f":"Calculation!JK19","v":"---"},{"$f":"Calculation!JN19","v":"---"},null,null,null,{"$f":"Calculation!JQ19","v":"---"},{"$f":"Calculation!JT19","v":"---"},{"$f":"Calculation!JW19","v":"---"},{"$f":"Calculation!JZ19","v":"---"}]
[null,null,10,null,{"$f":"Calculation!IY20","v":"---"},null,null,null,{"$f":"Calculation!JB20","v":"---"},{"$f":"Calculation!JE20","v":"---"},{"$f":"Calculation!JH20","v":"---"},{"$f":"Calculation!JK20","v":"---"},{"$f":"Calculation!JN20","v":"---"},null,null,null,{"$f":"Calculation!JQ20","v":"---"},{"$f":"Calculation!JT20","v":"---"},{"$f":"Calculation!JW20","v":"---"},{"$f":"Calculation!JZ20","v":"---"}]
[null,"Exterior"]
[null,null,"Cost of the Reference Wall"]
[null,null,"Unit cost",null,null,"Total cost"]
[null,null,{"$f":"Calculation!KL12","v":43.867089851851858},null,"€/m2",{"$f":"Calculation!KL13","v":10517.573462880004},null,"€"]

{"sheet":"SB_CostBen","index":15,"n_rows":26,"n_cols":20,"rows_kept":26,"cut":false,"hidden":false,"merged":[[11,16,11,17],[11,18,11,19],[5,1,5,8],[6,1,6,2],[6,3,6,8],[6,9,6,10],[6,11,6,16],[6,19,6,20],[9,2,9,10],[6,17,6,18],[7,8,7,13],[10,2,11,3],[10,4,10,11],[10,12,10,19],[11,4,11,7],[11,8,11,9],[12,2,12,3],[12,4,12,7],[12,12,12,15],[11,10,11,11],[11,12,11,15],[13,2,13,3],[13,4,13,7],[13,12,13,15],[14,2,14,3],[14,4,14,7],[14,12,14,15],[15,2,15,3],[15,4,15,7],[15,12,15,15],[16,2,16,3],[16,4,16,7],[16,12,16,15],[17,2,17,3],[17,4,17,7],[17,12,17,15],[18,2,18,3],[18,4,18,7],[18,12,18,15],[21,12,21,15],[23,2,23,10],[24,2,24,4],[24,5,24,7],[19,2,19,3],[19,4,19,7],[19,12,19,15],[20,2,20,3],[20,4,20,7],[20,12,20,15],[25,2,26,3],[25,4,26,4],[25,5,26,6],[25,7,26,7],[21,2,21,3],[21,4,21,7]]}
[]
[]
[]
[]
[]
[]
[null,"User name:",null,{"$f":"'Start Menu'!D7:I7","v":"Telmo Miguel Martins Ribeiro"},null,null,null,null,null,"File name:",null,{"$f":"'Start Menu'!L7:Q7","v":"Tyre4BuildIns Project"},null,null,null,null,null,"Date:",null,{"$f":"'Start Menu'!T7:U7","v":"2022-06-25"}]
[null,null,null,null,null,null,null,null,"Solution B"]
[]
[null,null,"Cost of the Reference Wall Materials"]
[null,null,"Layer",null,"Material 1",null,null,null,null,null,null,null,"Material 2"]
[null,"Interior",null,null,"Description",null,null,null,"Unit cost",null,"Unit consumption",null,"Description",null,null,null,"Unit cost",null,"Unit consumption"]
[null,null,1,null,{"$f":"Calculation!IY28","v":"Gypsum Board (12,5 mm) [Gyptec]"},null,null,null,{"$f":"Calculation!JB28","v":3.25},{"$f":"Calculation!JE28","v":"€/m²"},{"$f":"Calculation!JH28","v":1},{"$f":"Calculation!JK28","v":"m²/m²"},{"$f":"Calculation!JN28","v":"---"},null,null,null,{"$f":"Calculation!JQ28","v":"---"},{"$f":"Calculation!JT28","v":"---"},{"$f":"Calculation!JW28","v":"---"},{"$f":"Calculation!JZ28","v":"---"}]
[null,null,2,null,{"$f":"Calculation!IY29","v":"OSB (12 mm) [Kronospan]"},null,null,null,{"$f":"Calculation!JB29","v":7.32},{"$f":"Calculation!JE29","v":"€/m²"},{"$f":"Calculation!JH29","v":1},{"$f":"Calculation!JK29","v":"m²/m²"},{"$f":"Calculation!JN29","v":"---"},null,null,null,{"$f":"Calculation!JQ29","v":"---"},{"$f":"Calculation!JT29","v":"---"},{"$f":"Calculation!JW29","v":"---"},{"$f":"Calculation!JZ29","v":"---"}]
[null,null,3,null,{"$f":"Calculation!IY30","v":"Air Cavity (10 mm) [ISO 6946]"},null,null,null,{"$f":"Calculation!JB30","v":0},{"$f":"Calculation!JE30","v":"€/m²"},{"$f":"Calculation!JH30","v":1},{"$f":"Calculation!JK30","v":"m²/m²"},{"$f":"Calculation!JN30","v":"TB Strip XPS (10 mm) [IFoam]"},null,null,null,{"$f":"Calculation!JQ30","v":0.09},{"$f":"Calculation!JT30","v":"€/m²"},{"$f":"Calculation!JW30","v":3.3074074074074078},{"$f":"Calculation!JZ30","v":"m²/m²"}]
[null,null,4,null,{"$f":"Calculation!IY31","v":"Mineral wool (90 mm) [Volcalis]"},null,null,null,{"$f":"Calculation!JB31","v":2.9160000000000004},{"$f":"Calculation!JE31","v":"€/m²"},{"$f":"Calculation!JH31","v":1},{"$f":"Calculation!JK31","v":"m²/m²"},{"$f":"Calculation!JN31","v":"Steel C90/U93 (90 mm) [Pertecno]"},null,null,null,{"$f":"Calculation!JQ31","v":6.2348200000000009},{"$f":"Calculation!JT31","v":"€/m"},{"$f":"Calculation!JW31","v":3.3074074074074078},{"$f":"Calculation!JZ31","v":"m/m²"}]
[null,null,5,null,{"$f":"Calculation!IY32","v":"Air Cavity (10 mm) [ISO 6946]"},null,null,null,{"$f":"Calculation!JB32","v":0},{"$f":"Calculation!JE32","v":"€/m²"},{"$f":"Calculation!JH32","v":1},{"$f":"Calculation!JK32","v":"m²/m²"},{"$f":"Calculation!JN32","v":"TB Strip XPS (10 mm) [IFoam]"},null,null,null,{"$f":"Calculation!JQ32","v":0.09},{"$f":"Calculation!JT32","v":"€/m²"},{"$f":"Calculation!JW32","v":3.3074074074074078},{"$f":"Calculation!JZ32","v":"m²/m²"}]
[null,null,6,null,{"$f":"Calculation!IY33","v":"OSB (12 mm) [Kronospan]"},null,null,null,{"$f":"Calculation!JB33","v":7.32},{"$f":"Calculation!JE33","v":"€/m²"},{"$f":"Calculation!JH33","v":1},{"$f":"Calculation!JK33","v":"m²/m²"},{"$f":"Calculation!JN33","v":"---"},null,null,null,{"$f":"Calculation!JQ33","v":"---"},{"$f":"Calculation!JT33","v":"---"},{"$f":"Calculation!JW33","v":"---"},{"$f":"Calculation!JZ33","v":"---"}]
[null,null,7,null,{"$f":"Calculation!IY34","v":"Mortar (10 mm)"},null,null,null,{"$f":"Calculation!JB34","v":2.44},{"$f":"Calculation!JE34","v":"€/m²"},{"$f":"Calculation!JH34","v":1},{"$f":"Calculation!JK34","v":"m²/m²"},{"$f":"Calculation!JN34","v":"---"},null,null,null,{"$f":"Calculation!JQ34","v":"---"},{"$f":"Calculation!JT34","v":"---"},{"$f":"Calculation!JW34","v":"---"},{"$f":"Calculation!JZ34","v":"---"}]
[null,null,8,null,{"$f":"Calculation!IY35","v":"---"},null,null,null,{"$f":"Calculation!JB35","v":"---"},{"$f":"Calculation!JE35","v":"---"},{"$f":"Calculation!JH35","v":"---"},{"$f":"Calculation!JK35","v":"---"},{"$f":"Calculation!JN35","v":"---"},null,null,null,{"$f":"Calculation!JQ35","v":"---"},{"$f":"Calculation!JT35","v":"---"},{"$f":"Calculation!JW35","v":"---"},{"$f":"Calculation!JZ35","v":"---"}]
[null,null,9,null,{"$f":"Calculation!IY36","v":"---"},null,null,null,{"$f":"Calculation!JB36","v":"---"},{"$f":"Calculation!JE36","v":"---"},{"$f":"Calculation!JH36","v":"---"},{"$f":"Calculation!JK36","v":"---"},{"$f":"Calculation!JN36","v":"---"},null,null,null,{"$f":"Calculation!JQ36","v":"---"},{"$f":"Calculation!JT36","v":"---"},{"$f":"Calculation!JW36","v":"---"},{"$f":"Calculation!JZ36","v":"---"}]
[null,null,10,null,{"$f":"Calculation!IY37","v":"---"},null,null,null,{"$f":"Calculation!JB37","v":"---"},{"$f":"Calculation!JE37","v":"---"},{"$f":"Calculation!JH37","v":"---"},{"$f":"Calculation!JK37","v":"---"},{"$f":"Calculation!JN37","v":"---"},null,null,null,{"$f":"Calculation!JQ37","v":"---"},{"$f":"Calculation!JT37","v":"---"},{"$f":"Calculation!JW37","v":"---"},{"$f":"Calculation!JZ37","v":"---"}]
[null,"Exterior"]
[null,null,"Cost of the Improved Wall"]
[null,null,"Unit cost",null,null,"Total cost"]
[null,null,{"$f":"Calculation!KL29","v":44.462423185185195},null,"€/m2",{"$f":"Calculation!KL30","v":10660.310582880003},null,"€"]

{"sheet":"Comp_CostBen","index":16,"n_rows":25,"n_cols":30,"rows_kept":25,"cut":false,"hidden":false,"merged":[[6,19,6,20],[6,17,6,18],[15,2,15,5],[9,2,9,5],[16,5,16,6],[6,1,6,2],[6,3,6,8],[10,2,11,4],[12,2,13,4],[10,5,10,6],[10,7,10,8],[12,5,12,6],[12,7,12,8],[7,8,7,13],[6,9,6,10],[6,11,6,16],[16,2,17,4],[19,2,19,5],[19,6,19,8],[24,2,25,4],[16,7,16,8],[20,2,21,4],[20,5,21,5],[20,6,21,6],[24,17,25,18],[24,19,25,19],[24,8,25,10],[24,5,25,6],[24,7,25,7],[24,14,25,16],[24,11,25,12],[24,13,25,13]]}
[]
[]
[]
[]
[null,null,null,null,null,null,null,null,null,null,null,null,null,null,null,null,null,null,null,null,null,null,null,null,0,{"$f":"AA5","v":-142.73711999999978},{"$f":"-F25","v":-142.73711999999978},null,0,{"$f":"Z5","v":-142.73711999999978}]
[null,null,null,null,null,null,null,null,null,null,null,null,null,null,null,null,null,null,null,null,null,null,null,null,{"$f":"Y5+1","v":1},{"$f":"$L$25","v":58.462541416439308},{"$f":"AA5+$L$25","v":-84.274578583560469},null,5,{"$f":"Z10","v":58.462541416439308}]
[null,"User name:",null,{"$f":"'Start Menu'!D7:I7","v":"Telmo Miguel Martins Ribeiro"},null,null,null,null,null,"File name:",null,{"$f":"'Start Menu'!L7:Q7","v":"Tyre4BuildIns Project"},null,null,null,null,null,"Date:",null,{"$f":"'Start Menu'!T7:U7","v":"2022-06-25"},null,null,null,null,{"$f":"Y6+1","v":2},{"$f":"$L$25","v":58.462541416439308},{"$f":"AA6+$L$25","v":-25.812037167121161},null,10,{"$f":"Z15","v":58.462541416439308}]
[null,null,null,null,null,null,null,null,"Comparison",null,null,null,null,null,null,null,null,null,null,null,null,null,null,null,3,58.462541416439308,32.650504249318146,null,15,{"$f":"Z20","v":58.462541416439308}]
[null,null,null,null,null,null,null,null,null,null,null,null,null,null,null,null,null,null,null,null,null,null,null,null,4,58.462541416439308,91.113045665757454,null,20,{"$f":"Z25","v":58.462541416439308}]
[null,null,"Cost",null,null,null,null,null,null,null,null,null,null,null,null,null,null,null,null,null,null,null,null,null,5,58.462541416439308,149.57558708219676]
[null,null,"Solution A",null,null,"Unit",null,"Total",null,null,null,null,null,null,null,null,null,null,null,null,null,null,null,null,6,58.462541416439308,208.03812849863607]
[null,null,null,null,null,{"$f":"Calculation!IY43","v":43.867089851851858},"€/m2",{"$f":"Calculation!IY44","v":10517.573462880004},"€",null,null,null,null,null,null,null,null,null,null,null,null,null,null,null,7,58.462541416439308,266.50066991507538]
[null,null,"Solution B",null,null,"Unit",null,"Total",null,null,null,null,null,null,null,null,null,null,null,null,null,null,null,null,8,58.462541416439308,324.96321133151469]
[null,null,null,null,null,{"$f":"Calculation!IY45","v":44.462423185185195},"€/m2",{"$f":"Calculation!IY46","v":10660.310582880003},"€",null,null,null,null,null,null,null,null,null,null,null,null,null,null,null,9,58.462541416439308,383.42575274795399]
[null,null,null,null,null,null,null,null,null,null,null,null,null,null,null,null,null,null,null,null,null,null,null,null,10,58.462541416439308,441.8882941643933]
[null,null,"Energy Benefit",null,null,null,null,null,null,null,null,null,null,null,null,null,null,null,null,null,null,null,null,null,11,58.462541416439308,500.35083558083261]
[null,null,"Saved Energy (per year)",null,null,"Unit",null,"Total",null,null,null,null,null,null,null,null,null,null,null,null,null,null,null,null,12,58.462541416439308,558.81337699727192]
[null,null,null,null,null,{"$f":"Calculation!GJ63","v":0.97535104131530215},"kWh/m2/yr",{"$f":"Calculation!GJ64","v":233.85016566575723},"kWh/yr",null,null,null,null,null,null,null,null,null,null,null,null,null,null,null,13,58.462541416439308,617.27591841371122]
[null,null,null,null,null,null,null,null,null,null,null,null,null,null,null,null,null,null,null,null,null,null,null,null,14,58.462541416439308,675.73845983015053]
[null,null,"Electricity",null,null,null,null,null,null,null,null,null,null,null,null,null,null,null,null,null,null,null,null,null,15,58.462541416439308,734.20100124658984]
[null,null,"Cost per kWh",null,null,{"$f":"Calculation!IY47","v":0.25},"€/kWh",null,null,null,null,null,null,null,null,null,null,null,null,null,null,null,null,null,16,58.462541416439308,792.66354266302915]
[null,null,null,null,null,null,null,null,null,null,null,null,null,null,null,null,null,null,null,null,null,null,null,null,17,58.462541416439308,851.12608407946846]
[null,null,null,null,null,null,null,null,null,null,null,null,null,null,null,null,null,null,null,null,null,null,null,null,{"$f":"Y22+1","v":18},58.462541416439308,909.58862549590776]
[null,null,null,null,null,null,null,null,null,null,null,null,null,null,null,null,null,null,null,null,null,null,null,null,19,58.462541416439308,968.05116691234707]
[null,null,"Improvement Cost",null,null,{"$f":"Calculation!IY51","v":142.73711999999978},null,"€","Benefit (per year)",null,null,{"$f":"Calculation!IY52","v":58.462541416439308},null,"€/yr","Payback Period",null,null,{"$f":"Calculation!IY53","v":2.441514113853815},null,"yrs",null,null,null,null,20,58.462541416439308,1026.5137083287864]

{"sheet":"MCA","index":17,"n_rows":26,"n_cols":20,"rows_kept":26,"cut":false,"hidden":false,"merged":[[25,13,26,15],[25,7,26,9],[17,2,18,6],[21,2,22,6],[23,2,24,6],[25,2,26,6],[17,9,18,9],[14,10,14,12],[23,7,24,9],[23,13,24,15],[22,10,22,12],[23,10,24,12],[21,7,21,15],[15,7,16,8],[17,7,18,8],[22,7,22,9],[17,13,18,14],[15,15,16,15],[17,15,18,15],[15,13,16,14],[22,13,22,15],[12,2,12,5],[9,13,9,15],[10,13,10,15],[10,10,10,12],[6,19,6,20],[9,10,9,12],[6,1,6,2],[6,17,6,18],[6,3,6,8],[6,9,6,10],[6,11,6,16],[9,2,9,6],[9,7,9,9],[10,7,10,9],[10,17,11,19],[21,17,22,19],[23,17,25,19],[15,2,16,6],[13,2,14,6],[15,17,16,19],[17,17,18,19],[19,17,20,19],[13,17,14,19],[13,7,13,15],[20,2,20,5],[25,10,26,12],[15,10,16,12],[17,10,18,12],[15,9,16,9],[14,7,14,9],[14,13,14,15]]}
[]
[]
[]
[]
[]
[]
[null,"User name:",null,{"$f":"'Start Menu'!D7:I7","v":"Telmo Miguel Martins Ribeiro"},null,null,null,null,null,"File name:",null,{"$f":"'Start Menu'!L7:Q7","v":"Tyre4BuildIns Project"},null,null,null,null,null,"Date:",null,{"$f":"'Start Menu'!T7:U7","v":"2022-06-25"}]
[]
[]
[null,null,"Criteria Weights",null,null,null,null,"Energy Consumption",null,null,"Environmental Impacts",null,null,"Acquisition Cost"]
[null,null,null,null,null,null,null,{"$f":"Calculation!KT10","v":0.35},null,null,{"$f":"Calculation!KT11","v":0.15},null,null,{"$f":"Calculation!KT12","v":0.5},null,null,null,"Evaluation"]
[]
[null,null,"Decision Matrix"]
[null,null,"Solutions",null,null,null,null,"Criteria",null,null,null,null,null,null,null,null,null,"Solution A"]
[null,null,null,null,null,null,null,"Energy Consumption (unit area)",null,null,"Environmental Impacts",null,null,"Acquisition Cost (unit area)"]
[null,null,"A",null,null,null,null,{"$f":"Calculation!KT39","v":6.5852508790471793},null,"kWh/m2",{"$f":"Calculation!KU40","v":0.90429436191096935},null,null,{"$f":"Calculation!KV39","v":43.867089851851858},null,"€/m2",null,{"$f":"Calculation!LB39","v":0.94816099329692527}]
[]
[null,null,"B",null,null,null,null,{"$f":"Calculation!KT40","v":5.6098998377318772},null,"kWh/m2",{"$f":"Calculation!KU39","v":1},null,null,{"$f":"Calculation!KV40","v":44.462423185185195},null,"€/m2",null,"Solution B"]
[]
[null,null,null,null,null,null,null,null,null,null,null,null,null,null,null,null,null,{"$f":"Calculation!LB40","v":0.97894936247498698}]
[null,null,"Standardized Decision Matrix"]
[null,null,"Solutions",null,null,null,null,"Criteria",null,null,null,null,null,null,null,null,null,"Best Solution"]
[null,null,null,null,null,null,null,"Energy Consumption",null,null,"Environmental Impacts",null,null,"Acquisition Cost"]
[null,null,"A",null,null,null,null,{"$f":"Calculation!KY39","v":0.85188855227692928},null,null,{"$f":"Calculation!KZ39","v":1},null,null,{"$f":"Calculation!LA39","v":1},null,null,null,{"$f":"Calculation!LC39","v":"B"}]
[]
[null,null,"B",null,null,null,null,{"$f":"Calculation!KY40","v":1},null,null,{"$f":"Calculation!KZ40","v":0.90429436191096935},null,null,{"$f":"Calculation!LA40","v":0.98661041637668323}]

{"sheet":"Mat_DB","index":18,"n_rows":91,"n_cols":31,"rows_kept":91,"cut":false,"hidden":false,"merged":[[43,26,43,27],[44,26,44,27],[45,26,45,27],[46,26,46,27],[47,26,47,27],[48,26,48,27],[49,26,49,27],[50,26,50,27],[43,17,43,18],[44,17,44,18],[45,17,45,18],[46,17,46,18],[47,17,47,18],[48,17,48,18],[49,17,49,18],[50,17,50,18],[42,26,42,27],[34,17,34,18],[35,17,35,18],[36,17,36,18],[37,17,37,18],[38,17,38,18],[39,17,39,18],[40,17,40,18],[41,17,41,18],[42,17,42,18],[33,26,33,27],[34,26,34,27],[35,26,35,27],[36,26,36,27],[37,26,37,27],[38,26,38,27],[39,26,39,27],[40,26,40,27],[41,26,41,27],[27,17,27,18],[28,17,28,18],[29,17,29,18],[30,17,30,18],[31,17,31,18],[32,17,32,18],[33,17,33,18],[16,26,16,27],[17,26,17,27],[18,26,18,27],[19,26,19,27],[20,26,20,27],[21,26,21,27],[22,26,22,27],[23,26,23,27],[24,26,24,27],[25,26,25,27],[26,26,26,27],[27,26,27,27],[28,26,28,27],[29,26,29,27],[30,26,30,27],[31,26,31,27],[32,26,32,27],[18,17,18,18],[19,17,19,18],[20,17,20,18],[21,17,21,18],[22,17,22,18],[23,17,23,18],[24,17,24,18],[25,17,25,18],[26,17,26,18],[15,17,15,18],[9,26,10,27],[11,26,11,27],[12,26,12,27],[13,26,13,27],[14,26,14,27],[15,26,15,27],[16,17,16,18],[17,17,17,18],[39,3,39,6],[40,3,40,6],[41,3,41,6],[43,3,43,6],[43,7,43,8],[39,7,39,8],[35,12,35,13],[36,12,36,13],[37,12,37,13],[38,12,38,13],[39,12,39,13],[43,12,43,13],[36,3,36,6],[37,3,37,6],[38,3,38,6],[35,3,35,6],[40,7,40,8],[35,7,35,8],[36,7,36,8],[37,7,37,8],[38,7,38,8],[41,12,41,13],[42,12,42,13],[50,3,50,6],[51,7,51,8],[50,7,50,8],[59,3,59,6],[46,7,46,8],[41,7,41,8],[42,7,42,8],[44,7,44,8],[45,7,45,8],[48,3,48,6],[49,3,49,6],[42,3,42,6],[44,3,44,6],[45,3,45,6],[46,3,46,6],[58,3,58,6],[55,3,55,6],[47,3,47,6],[55,7,55,8],[54,3,54,6],[57,3,57,6],[52,3,52,6],[53,3,53,6],[56,3,56,6],[132,38,132,39],[133,38,133,39],[51,3,51,6],[57,17,57,18],[58,17,58,18],[59,17,59,18],[52,26,52,27],[53,26,53,27],[54,26,54,27],[55,26,55,27],[56,26,56,27],[57,26,57,27],[58,26,58,27],[59,26,59,27],[52,17,52,18],[115,38,115,39],[132,18,132,19],[133,18,133,19],[51,17,51,18],[51,26,51,27],[53,17,53,18],[54,17,54,18],[55,17,55,18],[56,17,56,18],[126,18,126,19],[127,18,127,19],[128,18,128,19],[129,18,129,19],[130,18,130,19],[131,18,131,19],[126,38,126,39],[127,38,127,39],[128,38,128,39],[129,38,129,39],[130,38,130,39],[131,38,131,39],[134,38,134,39],[125,38,125,39],[114,18,114,19],[115,18,115,19],[116,18,116,19],[117,18,117,19],[118,18,118,19],[119,18,119,19],[120,18,120,19],[121,18,121,19],[122,18,122,19],[116,38,116,39],[117,38,117,39],[118,38,118,39],[119,38,119,39],[120,38,120,39],[121,38,121,39],[122,38,122,39],[123,38,123,39],[124,38,124,39],[134,18,134,19],[123,18,123,19],[124,18,124,19],[125,18,125,19],[136,15,136,16],[119,15,119,16],[120,15,120,16],[121,15,121,16],[122,15,122,16],[123,15,123,16],[124,15,124,16],[125,15,125,16],[126,15,126,16],[139,15,139,16],[91,18,91,19],[92,18,92,19],[93,18,93,19],[94,18,94,19],[95,18,95,19],[96,18,96,19],[97,18,97,19],[98,18,98,19],[99,18,99,19],[100,18,100,19],[101,18,101,19],[102,18,102,19],[103,18,103,19],[104,18,104,19],[128,15,128,16],[129,15,129,16],[106,18,106,19],[111,15,111,16],[105,18,105,19],[107,18,107,19],[108,18,108,19],[109,18,109,19],[110,18,110,19],[138,15,138,16],[61,26,61,27],[91,15,91,16],[92,15,92,16],[93,15,93,16],[94,15,94,16],[95,15,95,16],[96,15,96,16],[106,15,106,16],[107,15,107,16],[108,15,108,16],[109,15,109,16],[127,15,127,16],[110,15,110,16],[111,18,111,19],[112,18,112,19],[113,18,113,19],[137,15,137,16],[130,15,130,16],[131,15,131,16],[132,15,132,16],[133,15,133,16],[134,15,134,16],[135,15,135,16],[57,12,57,13],[52,7,52,8],[112,15,112,16],[113,15,113,16],[114,15,114,16],[115,15,115,16],[116,15,116,16],[117,15,117,16],[118,15,118,16],[52,12,52,13],[53,7,53,8],[53,12,53,13],[54,7,54,8],[54,12,54,13],[56,7,56,8],[56,12,56,13],[11,7,11,8],[9,7,10,8],[101,15,101,16],[102,15,102,16],[103,15,103,16],[104,15,104,16],[105,15,105,16],[47,7,47,8],[48,7,48,8],[49,7,49,8],[72,12,72,13],[72,7,72,8],[58,7,58,8],[58,12,58,13],[59,7,59,8],[59,12,59,13],[55,12,55,13],[51,12,51,13],[97,15,97,16],[98,15,98,16],[99,15,99,16],[100,15,100,16],[50,12,50,13],[57,7,57,8],[29,7,29,8],[30,7,30,8],[31,7,31,8],[19,7,19,8],[28,7,28,8],[24,7,24,8],[12,7,12,8],[13,7,13,8],[26,7,26,8],[27,7,27,8],[25,7,25,8],[20,7,20,8],[21,7,21,8],[22,7,22,8],[17,7,17,8],[23,7,23,8],[14,7,14,8],[15,7,15,8],[16,7,16,8],[18,7,18,8],[8,71,8,72],[8,73,8,74],[23,12,23,13],[9,14,10,15],[47,12,47,13],[48,12,48,13],[49,12,49,13],[8,63,8,64],[8,65,8,66],[8,67,8,68],[11,12,11,13],[9,17,10,18],[11,17,11,18],[44,12,44,13],[45,12,45,13],[46,12,46,13],[40,12,40,13],[12,12,12,13],[13,12,13,13],[27,12,27,13],[8,69,8,70],[12,17,12,18],[13,17,13,18],[14,17,14,18],[34,3,34,6],[22,12,22,13],[17,12,17,13],[14,12,14,13],[15,12,15,13],[16,12,16,13],[25,12,25,13],[18,12,18,13],[19,12,19,13],[20,12,20,13],[21,12,21,13],[29,12,29,13],[30,12,30,13],[31,12,31,13],[32,12,32,13],[33,12,33,13],[34,12,34,13],[26,12,26,13],[28,12,28,13],[24,12,24,13],[27,3,27,6],[34,7,34,8],[32,7,32,8],[33,7,33,8],[11,3,11,6],[29,3,29,6],[30,3,30,6],[26,3,26,6],[28,3,28,6],[24,3,24,6],[31,3,31,6],[32,3,32,6],[33,3,33,6],[12,3,12,6],[13,3,13,6],[22,3,22,6],[17,3,17,6],[23,3,23,6],[14,3,14,6],[15,3,15,6],[16,3,16,6],[25,3,25,6],[18,3,18,6],[19,3,19,6],[20,3,20,6],[21,3,21,6],[6,1,6,2],[6,3,6,8],[6,9,6,10],[6,11,6,16],[6,17,6,18],[6,19,6,20],[9,2,10,2],[9,3,10,6],[9,12,10,13],[9,10,10,11],[60,3,60,6],[60,7,60,8],[60,12,60,13],[60,17,60,18],[60,26,60,27],[61,3,61,6],[61,7,61,8],[61,12,61,13],[61,17,61,18],[62,3,62,6],[62,7,62,8],[62,12,62,13],[62,17,62,18],[62,26,62,27],[63,3,63,6],[63,7,63,8],[63,12,63,13],[63,17,63,18],[63,26,63,27],[64,3,64,6],[64,7,64,8],[64,12,64,13],[64,17,64,18],[64,26,64,27],[65,3,65,6],[65,7,65,8],[65,12,65,13],[65,17,65,18],[65,26,65,27],[66,3,66,6],[66,7,66,8],[66,12,66,13],[66,17,66,18],[66,26,66,27],[67,3,67,6],[67,7,67,8],[67,12,67,13],[67,17,67,18],[67,26,67,27],[68,3,68,6],[68,7,68,8],[68,12,68,13],[68,17,68,18],[68,26,68,27],[69,3,69,6],[69,7,69,8],[69,12,69,13],[69,17,69,18],[69,26,69,27],[70,3,70,6],[70,7,70,8],[70,12,70,13],[70,17,70,18],[70,26,70,27],[71,3,71,6],[71,7,71,8],[71,12,71,13],[71,17,71,18],[71,26,71,27],[72,26,72,27],[73,3,73,6],[73,7,73,8],[73,12,73,13],[73,17,73,18],[73,26,73,27],[74,3,74,6],[74,7,74,8],[74,12,74,13],[74,17,74,18],[74,26,74,27],[72,3,72,6],[72,17,72,18],[75,3,75,6],[75,7,75,8],[75,12,75,13],[75,17,75,18],[75,26,75,27],[76,3,76,6],[76,7,76,8],[76,12,76,13],[76,17,76,18],[76,26,76,27],[77,3,77,6],[77,7,77,8],[77,12,77,13],[77,17,77,18],[77,26,77,27],[78,3,78,6],[78,7,78,8],[78,12,78,13],[78,17,78,18],[78,26,78,27],[79,3,79,6],[79,7,79,8],[79,12,79,13],[79,17,79,18],[79,26,79,27],[80,3,80,6],[80,7,80,8],[80,12,80,13],[80,17,80,18],[80,26,80,27],[81,3,81,6],[81,7,81,8],[81,12,81,13],[81,17,81,18],[81,26,81,27],[82,3,82,6],[82,7,82,8],[82,12,82,13],[82,17,82,18],[82,26,82,27],[83,3,83,6],[83,7,83,8],[83,12,83,13],[83,17,83,18],[83,26,83,27],[84,3,84,6],[84,7,84,8],[84,12,84,13],[84,17,84,18],[84,26,84,27],[85,3,85,6],[85,7,85,8],[85,12,85,13],[85,17,85,18],[85,26,85,27],[86,3,86,6],[86,7,86,8],[86,12,86,13],[86,17,86,18],[86,26,86,27],[87,3,87,6],[87,7,87,8],[87,12,87,13],[87,17,87,18],[87,26,87,27],[88,3,88,6],[88,7,88,8],[88,12,88,13],[88,17,88,18],[88,26,88,27],[89,3,89,6],[89,7,89,8],[89,12,89,13],[89,17,89,18],[89,26,89,27],[90,3,90,6],[90,7,90,8],[90,12,90,13],[90,17,90,18],[90,26,90,27]]}
[]
[]
[]
[]
[]
[]
[null,"User name:",null,{"$f":"'Start Menu'!D7:I7","v":"Telmo Miguel Martins Ribeiro"},null,null,null,null,null,"File name:",null,{"$f":"'Start Menu'!L7:Q7","v":"Tyre4BuildIns Project"},null,null,null,null,null,"Date:",null,{"$f":"'Start Menu'!T7:U7","v":"2022-06-25"}]
[]
[]
[null,null,"#","Material Name",null,null,null,"Type",null,"Thickness","λ or R",null,"Thermal Reference",null,"Unit Consumption",null,"Unit Cost","Cost Reference",null,"ADPE","ADPF","AP","EP","POCP","GWP","ODP","LCA Reference",null,"FL","SD","ST"]
[null,null,null,null,null,null,null,null,null,"[mm]",null,null,null,null,null,null,"[€/un]",null,null,"[kg SB-eq/un]","[MJ/un]","[kg SO2-eq/un]","[kg (PO4)3-eq/un]","[kg C2H4-eq/un]","[kg CO2-eq/un]","kg CFC11-eq/un",null,null,"[mm]","[mm]","[mm]"]
[null,null,1,"---","---","---","---","---",null,"---","---","---","---",null,"---","---","---","---",null,"---","---","---","---","---","---","---","---",null,"---","---","---"]
[null,null,{"$f":"C12+1","v":2},"Gypsum Board (6 mm) [Gyptec]","Plasterboard (6 mm) [Gyptec]","Plasterboard (6 mm) [Gyptec]","Plasterboard (6 mm) [Gyptec]","Sheathing Panel",null,6,0.2,"λ [W/(m·K)]","Gyptec",null,1,"m²/m²",5.03,"Gyptec",null,2.4479999999999997E-7,0.16799999999999998,5.7599999999999995E-3,5.2800000000000004E-4,4.5119999999999996E-4,1.2,2.9280000000000001E-8,"Gyproc",null,"---","---","---"]
[null,null,3,"Gypsum Board (9,5 mm) [Gyptec]","Plasterboard (9,5 mm) [Gyptec]","Plasterboard (9,5 mm) [Gyptec]","Plasterboard (9,5 mm) [Gyptec]","Sheathing Panel",null,9.5,0.2,"λ [W/(m·K)]","Gyptec",null,1,"m²/m²",3.51,"Gyptec",null,3.876E-7,0.26599999999999996,9.1199999999999996E-3,8.3600000000000005E-4,7.1440000000000002E-4,1.9,4.6360000000000006E-8,"Gyproc",null,"---","---","---"]
[null,null,4,"Gypsum Board (12,5 mm) [Gyptec]","Plasterboard (12,5 mm) [Gyptec]","Plasterboard (12,5 mm) [Gyptec]","Plasterboard (12,5 mm) [Gyptec]","Sheathing Panel",null,12.5,0.17499999999999999,"λ [W/(m·K)]","Gyptec",null,1,"m²/m²",3.25,"Gyptec",null,5.0999999999999999E-7,0.35,1.2E-2,1.1000000000000001E-3,9.3999999999999997E-4,2.5,6.1000000000000004E-8,"Gyproc",null,"---","---","---"]
[null,null,5,"Gypsum Board (15 mm) [Gyptec]","Plasterboard (15 mm) [Gyptec]","Plasterboard (15 mm) [Gyptec]","Plasterboard (15 mm) [Gyptec]","Sheathing Panel",null,15,0.185,"λ [W/(m·K)]","Gyptec",null,1,"m²/m²",3.9,"Gyptec",null,6.1199999999999992E-7,0.42,1.44E-2,1.32E-3,1.1279999999999999E-3,3,7.3200000000000007E-8,"Gyproc",null,"---","---","---"]
[null,null,6,"Gypsum Board (18 mm) [Gyptec]","Plasterboard (18 mm) [Gyptec]","Plasterboard (18 mm) [Gyptec]","Plasterboard (18 mm) [Gyptec]","Sheathing Panel",null,18,0.2,"λ [W/(m·K)]","Gyptec",null,1,"m²/m²",5.21,"Gyptec",null,7.3439999999999991E-7,0.504,1.728E-2,1.5840000000000001E-3,1.3535999999999999E-3,3.5999999999999996,8.7839999999999998E-8,"Gyproc",null,"---","---","---"]
[null,null,7,"OSB (9 mm) [Kronospan]","OSB (9 mm) [Kronospan]","OSB (9 mm) [Kronospan]","OSB (9 mm) [Kronospan]","Sheathing Panel",null,9,0.13,"λ [W/(m·K)]","Kronospan",null,1,"m²/m²",5.49,"Kronospan",null,7.4250000000000009E-7,38.519999999999996,8.2710000000000006E-3,1.9710000000000001E-3,4.6980000000000008E-3,-6.7769999999999992,8.4870000000000001E-13,"Egger",null,"---","---","---"]
[null,null,8,"OSB (12 mm) [Kronospan]","OSB (12 mm) [Kronospan]","OSB (12 mm) [Kronospan]","OSB (12 mm) [Kronospan]","Sheathing Panel",null,12,0.13,"λ [W/(m·K)]","Kronospan",null,1,"m²/m²",7.32,"Kronospan",null,9.9000000000000005E-7,51.36,1.1028000000000001E-2,2.6280000000000001E-3,6.2640000000000005E-3,-9.0359999999999996,1.1315999999999999E-12,"Egger",null,"---","---","---"]
[null,null,9,"OSB (15 mm) [Kronospan]","OSB (15 mm) [Kronospan]","OSB (15 mm) [Kronospan]","OSB (15 mm) [Kronospan]","Sheathing Panel",null,15,0.13,"λ [W/(m·K)]","Kronospan",null,1,"m²/m²",9.07,"Kronospan",null,1.2375E-6,64.2,1.3785000000000002E-2,3.2850000000000002E-3,7.8300000000000002E-3,-11.295,1.4144999999999999E-12,"Egger",null,"---","---","---"]
[null,null,10,"OSB (18 mm) [Kronospan]","OSB (18 mm) [Kronospan]","OSB (18 mm) [Kronospan]","OSB (18 mm) [Kronospan]","Sheathing Panel",null,18,0.13,"λ [W/(m·K)]","Kronospan",null,1,"m²/m²",10.93,"Kronospan",null,1.4850000000000002E-6,77.039999999999992,1.6542000000000001E-2,3.9420000000000002E-3,9.3960000000000016E-3,-13.553999999999998,1.6974E-12,"Egger",null,"---","---","---"]
[null,null,11,"OSB (22 mm) [Kronospan]","OSB (22 mm) [Kronospan]","OSB (22 mm) [Kronospan]","OSB (22 mm) [Kronospan]","Sheathing Panel",null,22,0.13,"λ [W/(m·K)]","Kronospan",null,1,"m²/m²",13.43,"Kronospan",null,1.815E-6,94.16,2.0218000000000003E-2,4.8180000000000002E-3,1.1484000000000001E-2,-16.565999999999999,2.0745999999999997E-12,"Egger",null,"---","---","---"]
[null,null,12,"OSB (25 mm) [Kronospan]","OSB (25 mm) [Kronospan]","OSB (25 mm) [Kronospan]","OSB (25 mm) [Kronospan]","Sheathing Panel",null,25,0.13,"λ [W/(m·K)]","Kronospan",null,1,"m²/m²",15.06,"Kronospan",null,2.0625000000000002E-6,107,2.2975000000000006E-2,5.4750000000000007E-3,1.3050000000000003E-2,-18.824999999999999,2.3575E-12,"Egger",null,"---","---","---"]
[null,null,13,"Mineral wool (10 mm) [Volcalis]","Mineral wool (10 mm) [Volcalis]","Mineral wool (10 mm) [Volcalis]","Mineral wool (10 mm) [Volcalis]","Cavity Insulation",null,10,3.5000000000000003E-2,"λ [W/(m·K)]","Volcalis",null,1,"m²/m²",0.32400000000000007,"Volcalis",null,1.1200000000000001E-5,3.4600000000000004,1.01E-3,2.0799999999999999E-4,7.1799999999999997E-5,0.16900000000000001,1.7699999999999999E-12,"Knauf",null,"---","---","---"]
[null,null,14,"Mineral wool (50 mm) [Volcalis]","Mineral wool (50 mm) [Volcalis]","Mineral wool (50 mm) [Volcalis]","Mineral wool (50 mm) [Volcalis]","Cavity Insulation",null,50,3.5000000000000003E-2,"λ [W/(m·K)]","Volcalis",null,1,"m²/m²",1.62,"Volcalis",null,5.5999999999999999E-5,17.3,5.0499999999999998E-3,1.0399999999999999E-3,3.59E-4,0.84499999999999997,8.8499999999999988E-12,"Knauf",null,"---","---","---"]
[null,null,15,"Mineral wool (90 mm) [Volcalis]","Mineral wool (90 mm) [Volcalis]","Mineral wool (90 mm) [Volcalis]","Mineral wool (90 mm) [Volcalis]","Cavity Insulation",null,90,3.5000000000000003E-2,"λ [W/(m·K)]","Volcalis",null,1,"m²/m²",2.9160000000000004,"Volcalis",null,1.008E-4,31.14,9.0899999999999991E-3,1.872E-3,6.4619999999999999E-4,1.5209999999999999,1.5929999999999997E-11,"Knauf",null,"---","---","---"]
[null,null,16,"Mineral wool (100 mm) [Volcalis]",null,null,null,"Cavity Insulation",null,100,3.5000000000000003E-2,"λ [W/(m·K)]","Volcalis",null,1,"m²/m²",3.24,"Volcalis",null,1.12E-4,34.6,1.01E-2,2.0799999999999998E-3,7.18E-4,1.69,1.7699999999999998E-11,"Knauf",null,"---","---","---"]
[null,null,17,"Mineral wool (120 mm) [Volcalis]",null,null,null,"Cavity Insulation",null,120,3.5000000000000003E-2,"λ [W/(m·K)]","Volcalis",null,1,"m²/m²",3.8879999999999999,"Volcalis",null,1.3439999999999999E-4,41.52,1.2119999999999999E-2,2.4959999999999995E-3,8.6160000000000002E-4,2.028,2.1239999999999996E-11,"Knauf",null,"---","---","---"]
[null,null,18,"Mineral wool (200 mm) [Volcalis]","Mineral wool (200 mm) [Volcalis]","Mineral wool (200 mm) [Volcalis]","Mineral wool (200 mm) [Volcalis]","Cavity Insulation",null,200,3.5000000000000003E-2,"λ [W/(m·K)]","Volcalis",null,1,"m²/m²",6.48,"Volcalis",null,2.24E-4,69.2,2.0199999999999999E-2,4.1599999999999996E-3,1.436E-3,3.38,3.5399999999999995E-11,"Knauf",null,"---","---","---"]
[null,null,19,"ETICS EPS (40 mm) [Weber]","ETICS EPS (10 cm) [Atlas]","ETICS EPS (10 cm) [Atlas]","ETICS EPS (10 cm) [Atlas]","External Insulation",null,40,1.1499999999999999,"R [(m²·K)/W]","Cype",null,1,"m²/m²",34.200000000000003,"Cype",null,5.2000000000000005E-2,79.52000000000001,1.5120000000000003E-2,1.7200000000000002E-3,1.8400000000000001E-3,4.7600000000000007,5.2253600000000012E-7,"Atlas",null,"---","---","---"]
[null,null,20,"ETICS EPS (50 mm) [Weber]","ETICS EPS (12 cm) [Atlas]","ETICS EPS (12 cm) [Atlas]","ETICS EPS (12 cm) [Atlas]","External Insulation",null,50,1.4375,"R [(m²·K)/W]","Cype",null,1,"m²/m²",35.725000000000001,"Cype",null,6.5000000000000002E-2,99.4,1.8900000000000004E-2,2.15E-3,2.3E-3,5.95,6.5317000000000007E-7,"Atlas",null,"---","---","---"]
[null,null,21,"ETICS EPS (70 mm) [Weber]","ETICS EPS (15 cm) [Atlas]","ETICS EPS (15 cm) [Atlas]","ETICS EPS (15 cm) [Atlas]","External Insulation",null,70,2.0124999999999997,"R [(m²·K)/W]","Cype",null,1,"m²/m²",38.775000000000006,"Cype",null,9.0999999999999998E-2,139.16,2.6460000000000004E-2,3.0099999999999997E-3,3.2199999999999998E-3,8.33,9.1443800000000008E-7,"Atlas",null,"---","---","---"]
[null,null,22,"ETICS EPS (100 mm) [Weber]","ETICS EPS (20 cm) [Atlas]","ETICS EPS (20 cm) [Atlas]","ETICS EPS (20 cm) [Atlas]","External Insulation",null,100,2.875,"R [(m²·K)/W]","Cype",null,1,"m²/m²",43.35,"Cype",null,0.13,198.8,3.7800000000000007E-2,4.3E-3,4.5999999999999999E-3,11.9,1.3063400000000001E-6,"Atlas",null,"---","---","---"]
[null,null,23,"ETICS EPS (120 mm) [Weber]","ETICS EPS (50 mm)","ETICS EPS (50 mm)","ETICS EPS (50 mm)","External Insulation",null,120,3.4499999999999997,"R [(m²·K)/W]","Cype",null,1,"m²/m²",46.400000000000006,"Cype",null,0.156,238.56,4.5360000000000004E-2,5.1599999999999997E-3,5.5199999999999997E-3,14.28,1.567608E-6,null,null,"---","---","---"]
[null,null,24,"ETICS EPS (150 mm) [Weber]","ETICS EPS (70 mm)","ETICS EPS (70 mm)","ETICS EPS (70 mm)","External Insulation",null,150,4.3125,"R [(m²·K)/W]","Cype",null,1,"m²/m²",50.975000000000001,"Cype",null,0.19500000000000001,298.20000000000005,5.6700000000000014E-2,6.45E-3,6.8999999999999999E-3,17.850000000000001,1.9595100000000003E-6,null,null,"---","---","---"]
[null,null,25,"Steel C90/U93 (90 mm) [Pertecno]","Steel Stud (90 mm) [Pertecno]","Steel Stud (90 mm) [Pertecno]","Steel Stud (90 mm) [Pertecno]","LSF Structure (Studs/Tracks)",null,90,50,"λ [W/(m·K)]","Pertecno",null,"---","m/m²",6.2348200000000009,"Pertecno",null,1.3118837600000001E-7,72.901300000000006,2.5764120000000004E-5,1.501694E-6,4.6603460000000003E-4,5.5312800000000013E-3,0,"Pertecno",null,43,90,1.5]
[null,null,26,"Steel C150/U153 (150 mm) [Pertecno]","Steel Stud (150 mm) [Pertecno]","Steel Stud (150 mm) [Pertecno]","Steel Stud (150 mm) [Pertecno]","LSF Structure (Studs/Tracks)",null,150,50,"λ [W/(m·K)]","Pertecno",null,"---","m/m²",8.0492400000000011,"Pertecno",null,1.6936603199999999E-7,94.116600000000005,3.3261840000000003E-5,1.938708E-6,6.0165719999999998E-4,7.1409600000000009E-3,0,"Pertecno",null,43,150,1.5]
[null,null,27,"Steel C200/U204 (200 mm) [Pertecno]","Steel Stud (200 mm) [Pertecno]","Steel Stud (200 mm) [Pertecno]","Steel Stud (200 mm) [Pertecno]","LSF Structure (Studs/Tracks)",null,200,50,"λ [W/(m·K)]","Pertecno",null,"---","m/m²",12.74977,"Pertecno",null,2.6827103600000001E-7,149.07804999999999,5.2685820000000004E-5,3.070859E-6,9.5300810000000001E-4,1.1311080000000001E-2,0,"Pertecno",null,43,200,1.5]
[null,null,28,"Steel C250/U255 (250 mm) [Pertecno]","Steel Stud (250 mm) [Pertecno]","Steel Stud (250 mm) [Pertecno]","Steel Stud (250 mm) [Pertecno]","LSF Structure (Studs/Tracks)",null,250,50,"λ [W/(m·K)]","Pertecno",null,"---","m/m²",18.46031,"Pertecno",null,3.8842790799999997E-7,215.84915000000001,7.6283460000000006E-5,4.4462769999999997E-6,1.3798542999999999E-3,1.6377240000000001E-2,0,"Pertecno",null,43,250,1.5]
[null,null,29,"TB Strip Aerogel (10 mm) [Spacetherm]",null,null,null,"Thermal Break Strip",null,10,1.4999999999999999E-2,"λ [W/(m·K)]","Spacetherm",null,"---","m/m²",3.86,"Spacetherm",null,2.4449500000000002E-6,4.5789499999999999,3.0195E-3,3.1030000000000001E-4,2.0785000000000001E-4,0.624,1.7075000000000002E-7,"Spacetherm",null,"---","---","---"]
[null,null,30,"TB Strip Rubber (10 mm) [Acousticork]",null,null,null,"Thermal Break Strip",null,10,0.122,"λ [W/(m·K)]","Acousticork",null,"---","m/m²",0.77,"Acousticork",null,null,null,null,null,null,null,null,null,null,"---","---","---"]
[null,null,31,"TB Strip Aerogel/Rubber (10 mm) [T4BI]",null,null,null,"Thermal Break Strip",null,10,2.3E-2,"λ [W/(m·K)]","Tyre4BuildIns",null,"---","m/m²",110.82,"Tyre4BuildIns",null,null,null,null,null,null,null,null,null,null,"---","---","---"]
[null,null,32,"TB Strip Rubber and Cork (10 mm) [Acousticork]","TB Strip Rubber and Cork (10 mm)","TB Strip Rubber and Cork (10 mm)","TB Strip Rubber and Cork (10 mm)","Thermal Break Strip",null,10,8.8999999999999996E-2,"λ [W/(m·K)]","Acousticork",null,"---","m/m²",1.92,"Acousticork",null,null,null,null,null,null,null,null,null,null,"---","---","---"]
[null,null,33,"TB Strip XPS (10 mm) [IFoam]",null,null,null,"Thermal Break Strip",null,10,3.5000000000000003E-2,"λ [W/(m·K)]","IFoam",null,"---","m²/m²",0.09,"IFoam",null,3.7647058823529416E-7,16.441176470588236,3.0588235294117649E-3,3.9705882352941181E-4,1.8529411764705883E-4,0.75588235294117645,2.5058823529411764E-8,"Danosa",null,"---","---","---"]
[null,null,34,"Air Cavity (10 mm) [ISO 6946]",null,null,null,"Air Cavity",null,10,"---","R [(m²·K)/W]","ISO 6946",null,"---","m²/m²",0,null,null,null,null,null,null,null,null,null,null,null,"---","---","---"]
[null,null,35,"Air Cavity (15 mm) [ISO 6946]",null,null,null,"Air Cavity",null,15,"---","R [(m²·K)/W]","ISO 6946",null,"---","m²/m²",0,null,null,null,null,null,null,null,null,null,null,null,"---","---","---"]
[null,null,36,"Air Cavity (20 mm) [ISO 6946]",null,null,null,"Air Cavity",null,20,"---","R [(m²·K)/W]","ISO 6946",null,"---","m²/m²",0,null,null,null,null,null,null,null,null,null,null,null,"---","---","---"]
[null,null,37,"Air Cavity (25 mm) [ISO 6946]",null,null,null,"Air Cavity",null,25,"---","R [(m²·K)/W]","ISO 6946",null,"---","m²/m²",0,null,null,null,null,null,null,null,null,null,null,null,"---","---","---"]
[null,null,38,"Air Cavity (90 mm) [ISO 6946]",null,null,null,"Air Cavity",null,90,"---","R [(m²·K)/W]","ISO 6946",null,"---","m²/m²",0,null,null,null,null,null,null,null,null,null,null,null,"---","---","---"]
[null,null,39,"Air Cavity (150 mm) [ISO 6946]",null,null,null,"Air Cavity",null,150,"---","R [(m²·K)/W]","ISO 6946",null,"---","m²/m²",0,null,null,null,null,null,null,null,null,null,null,null,"---","---","---"]
[null,null,40,"Air Cavity (200 mm) [ISO 6946]",null,null,null,"Air Cavity",null,200,"---","R [(m²·K)/W]","ISO 6946",null,"---","m²/m²",0,null,null,null,null,null,null,null,null,null,null,null,"---","---","---"]
[null,null,41,"Mortar (10 mm)",null,null,null,"Other",null,10,1.8,"λ [W/(m·K)]","ITE50",null,1,"m²/m²",2.44,"Cype",null,3.1700000000000001E-6,9.0500000000000007,4.8799999999999998E-3,9.9799999999999997E-4,2.4499999999999999E-4,1.42,9.6600000000000005E-8,"EPD27",null,"---","---","---"]
[null,null,42]
[null,null,{"$f":"C53+1","v":43}]
[null,null,{"$f":"C54+1","v":44}]
[null,null,45]
[null,null,46]
[null,null,47]
[null,null,48]
[null,null,49]
[null,null,50]
[null,null,51]
[null,null,52]
[null,null,53]
[null,null,54]
[null,null,55]
[null,null,56]
[null,null,57]
[null,null,58]
[null,null,59]
[null,null,60]
[null,null,61]
[null,null,62]
[null,null,63]
[null,null,64]
[null,null,65]
[null,null,{"$f":"C76+1","v":66}]
[null,null,67]
[null,null,68]
[null,null,69]
[null,null,70]
[null,null,71]
[null,null,72]
[null,null,73]
[null,null,74]
[null,null,75]
[null,null,76]
[null,null,77]
[null,null,78]
[null,null,79]
[null,null,80]

{"sheet":"Loc_DB","index":19,"n_rows":61,"n_cols":20,"rows_kept":61,"cut":false,"hidden":false,"merged":[[46,18,46,19],[47,18,47,19],[47,9,47,12],[47,13,47,16],[48,18,48,19],[44,18,44,19],[43,18,43,19],[44,13,44,16],[45,13,45,16],[46,13,46,16],[48,9,48,12],[48,13,48,16],[43,13,43,16],[22,13,22,16],[23,9,23,12],[23,13,23,16],[20,13,20,16],[24,9,24,12],[18,13,18,16],[19,9,19,12],[45,18,45,19],[22,9,22,12],[31,9,31,12],[41,13,41,16],[42,9,42,12],[42,13,42,16],[35,13,35,16],[34,13,34,16],[38,9,38,12],[39,9,39,12],[35,9,35,12],[19,13,19,16],[39,13,39,16],[44,9,44,12],[45,9,45,12],[40,13,40,16],[32,9,32,12],[9,5,10,5],[9,6,10,8],[9,9,9,12],[10,9,10,12],[9,13,9,16],[10,13,10,16],[6,1,6,2],[6,3,6,8],[6,9,6,10],[6,11,6,16],[6,17,6,18],[6,19,6,20],[11,6,11,8],[11,9,11,12],[11,13,11,16],[13,6,13,8],[14,6,14,8],[15,6,15,8],[16,6,16,8],[12,13,12,16],[17,6,17,8],[13,9,13,12],[13,13,13,16],[14,9,14,12],[14,13,14,16],[15,9,15,12],[15,13,15,16],[16,9,16,12],[12,6,12,8],[12,9,12,12],[16,13,16,16],[17,9,17,12],[17,13,17,16],[18,6,18,8],[19,6,19,8],[20,6,20,8],[18,9,18,12],[20,9,20,12],[31,13,31,16],[24,13,24,16],[21,9,21,12],[21,13,21,16],[25,9,25,12],[25,13,25,16],[26,9,26,12],[26,13,26,16],[27,9,27,12],[27,13,27,16],[28,9,28,12],[28,13,28,16],[29,9,29,12],[29,13,29,16],[30,9,30,12],[21,6,21,8],[22,6,22,8],[30,13,30,16],[23,6,23,8],[36,13,36,16],[37,9,37,12],[37,13,37,16],[38,13,38,16],[32,13,32,16],[33,13,33,16],[24,6,24,8],[25,6,25,8],[26,6,26,8],[27,6,27,8],[28,6,28,8],[37,6,37,8],[38,6,38,8],[29,6,29,8],[46,6,46,8],[46,9,46,12],[47,6,47,8],[30,6,30,8],[31,6,31,8],[32,6,32,8],[33,6,33,8],[34,6,34,8],[35,6,35,8],[36,6,36,8],[40,6,40,8],[41,6,41,8],[43,9,43,12],[40,9,40,12],[41,9,41,12],[44,6,44,8],[45,6,45,8],[43,6,43,8],[33,9,33,12],[34,9,34,12],[36,9,36,12],[42,6,42,8],[39,6,39,8],[63,5,63,7],[63,8,63,9],[63,10,63,11],[63,12,63,13],[63,14,63,15],[63,16,63,17],[62,5,62,7],[62,8,62,9],[62,10,62,11],[62,12,62,13],[62,14,62,15],[58,13,58,16],[59,6,59,8],[62,16,62,17],[51,6,51,8],[51,9,51,12],[51,13,51,16],[52,6,52,8],[60,6,60,8],[60,9,60,12],[60,13,60,16],[53,9,53,12],[53,13,53,16],[52,9,52,12],[52,13,52,16],[48,6,48,8],[49,6,49,8],[49,9,49,12],[49,13,49,16],[50,6,50,8],[50,9,50,12],[50,13,50,16],[59,9,59,12],[59,13,59,16],[54,9,54,12],[54,13,54,16],[55,6,55,8],[55,9,55,12],[55,13,55,16],[56,6,56,8],[56,9,56,12],[56,13,56,16],[57,6,57,8],[57,9,57,12],[57,13,57,16],[54,6,54,8],[53,6,53,8],[58,6,58,8],[58,9,58,12]]}
[]
[]
[]
[]
[]
[]
[null,"User name:",null,{"$f":"'Start Menu'!D7:I7","v":"Telmo Miguel Martins Ribeiro"},null,null,null,null,null,"File name:",null,{"$f":"'Start Menu'!L7:Q7","v":"Tyre4BuildIns Project"},null,null,null,null,null,"Date:",null,{"$f":"'Start Menu'!T7:U7","v":"2022-06-25"}]
[]
[]
[null,null,null,null,null,"#","Local",null,null,"Heating Degree-Days",null,null,null,"Cooling Degree-Days"]
[null,null,null,null,null,null,null,null,null,"(Ref. Temp. 18 ºC)",null,null,null,"(Ref. Temp. 25 ºC)"]
[null,null,null,null,null,1,"---",null,null,"---",null,null,null,"---"]
[null,null,null,null,null,{"$f":"F12+1","v":2},"Copenhagen_DK",null,null,6272,null,null,null,0]
[null,null,null,null,null,{"$f":"F13+1","v":3},"Helsinki_FI",null,null,4854,null,null,null,4]
[null,null,null,null,null,4,"Minsk_BY",null,null,4452,null,null,null,5]
[null,null,null,null,null,5,"Oslo_NO",null,null,6334,null,null,null,0]
[null,null,null,null,null,6,"Stockholm_SE",null,null,4351,null,null,null,3]
[null,null,null,null,null,7,"Berlin_DE",null,null,3211,null,null,null,28]
[null,null,null,null,null,8,"Brussels_BE",null,null,2974,null,null,null,16]
[null,null,null,null,null,9,"Vienna_AT",null,null,3258,null,null,null,35]
[null,null,null,null,null,10,"London_GB",null,null,3008,null,null,null,6]
[null,null,null,null,null,11,"Prague_CZ",null,null,3809,null,null,null,15]
[null,null,null,null,null,12,"Athens_GR",null,null,1142,null,null,null,269]
[null,null,null,null,null,13,"Coimbra_PT",null,null,1485,null,null,null,87]
[null,null,null,null,null,14,"Madrid_SP",null,null,2066,null,null,null,212]
[null,null,null,null,null,15,"Marseille_FR",null,null,1776,null,null,null,106]
[null,null,null,null,null,16,"Rome_IT",null,null,1508,null,null,null,73]
[null,null,null,null,null,17]
[null,null,null,null,null,18]
[null,null,null,null,null,19]
[null,null,null,null,null,20]
[null,null,null,null,null,21]
[null,null,null,null,null,22]
[null,null,null,null,null,23]
[null,null,null,null,null,24]
[null,null,null,null,null,25]
[null,null,null,null,null,26]
[null,null,null,null,null,27]
[null,null,null,null,null,{"$f":"F38+1","v":28}]
[null,null,null,null,null,{"$f":"F39+1","v":29}]
[null,null,null,null,null,{"$f":"F40+1","v":30}]
[null,null,null,null,null,{"$f":"F41+1","v":31}]
[null,null,null,null,null,32]
[null,null,null,null,null,33]
[null,null,null,null,null,34]
[null,null,null,null,null,35]
[null,null,null,null,null,36]
[null,null,null,null,null,37]
[null,null,null,null,null,38]
[null,null,null,null,null,39]
[null,null,null,null,null,40]
[null,null,null,null,null,41]
[null,null,null,null,null,42]
[null,null,null,null,null,43]
[null,null,null,null,null,44]
[null,null,null,null,null,45]
[null,null,null,null,null,46]
[null,null,null,null,null,47]
[null,null,null,null,null,48]
[null,null,null,null,null,49]
[null,null,null,null,null,{"$f":"F60+1","v":50}]

{"sheet":"Calculation","index":20,"n_rows":375,"n_cols":542,"rows_kept":375,"cut":false,"hidden":false,"merged":[[180,200,180,201],[18,40,19,42],[34,40,35,42],[19,78,19,79],[39,78,39,79],[19,80,19,81],[39,80,39,81],[71,100,71,102],[66,100,66,102],[64,104,65,106],[66,104,66,106],[67,104,67,106],[64,108,65,110],[6,40,7,50],[70,100,70,102],[19,102,19,104],[15,72,15,73],[7,57,11,57],[7,58,11,58],[7,60,7,61],[7,62,7,63],[8,60,8,61],[8,62,8,63],[10,59,11,59],[10,60,11,60],[10,61,11,61],[10,62,11,62],[10,63,11,63],[45,60,45,61],[47,60,48,60],[47,61,48,61],[35,74,35,75],[7,54,9,54],[7,55,9,55],[36,90,36,91],[37,90,37,91],[34,90,34,91],[35,90,35,91],[63,191,63,193],[63,194,63,196],[64,84,65,86],[66,96,66,98],[67,96,67,98],[64,100,65,102],[67,100,67,102],[68,100,68,102],[69,100,69,102],[58,191,58,193],[59,185,59,187],[59,188,59,190],[59,191,59,193],[53,183,53,184],[54,183,54,184],[55,183,55,184],[61,183,61,184],[60,183,60,184],[53,185,53,187],[54,185,54,187],[62,185,62,187],[62,188,62,190],[63,185,63,187],[59,183,59,184],[58,120,58,121],[62,128,62,130],[63,128,63,130],[54,120,55,124],[61,185,61,187],[60,185,60,187],[53,188,53,190],[54,188,54,190],[55,188,55,190],[60,188,60,190],[61,188,61,190],[22,185,22,187],[22,188,22,190],[23,185,23,187],[23,188,23,190],[62,194,62,196],[44,194,44,196],[30,183,31,190],[44,191,44,193],[45,191,45,193],[45,194,45,196],[62,191,62,193],[45,185,45,187],[45,188,45,190],[36,185,36,187],[37,185,37,187],[36,188,36,190],[37,188,37,190],[26,188,26,190],[27,183,27,184],[27,185,27,187],[27,188,27,190],[28,185,28,187],[43,191,43,193],[8,195,8,196],[24,185,24,187],[44,185,44,187],[44,188,44,190],[38,185,38,187],[38,188,38,190],[39,185,39,187],[39,188,39,190],[40,185,40,187],[60,191,60,193],[61,191,61,193],[57,183,57,184],[57,185,57,187],[57,188,57,190],[57,191,57,193],[56,183,56,184],[56,185,56,187],[56,188,56,190],[49,185,49,187],[49,188,49,190],[50,183,50,184],[50,185,50,187],[50,188,50,190],[51,183,51,184],[51,185,51,187],[51,188,51,190],[52,183,52,184],[52,185,52,187],[52,188,52,190],[39,191,39,193],[27,194,27,196],[33,188,33,190],[6,183,7,190],[8,185,8,187],[8,188,8,190],[9,183,9,184],[9,185,9,187],[9,188,9,190],[11,183,11,184],[11,185,11,187],[11,188,11,190],[10,183,10,184],[10,185,10,187],[10,188,10,190],[22,191,22,193],[13,188,13,190],[14,183,14,184],[19,183,19,184],[19,185,19,187],[19,188,19,190],[14,185,14,187],[14,188,14,190],[21,185,21,187],[21,188,21,190],[21,183,21,184],[22,183,22,184],[12,188,12,190],[8,193,8,194],[12,183,12,184],[13,183,13,184],[13,185,13,187],[13,192,13,193],[14,192,14,193],[12,185,12,187],[6,7,7,7],[6,8,7,8],[6,9,7,9],[6,5,7,5],[6,6,7,6],[6,4,7,4],[6,11,7,12],[13,74,13,76],[33,74,33,76],[14,72,14,73],[18,90,18,91],[19,90,19,91],[20,90,20,91],[21,90,21,91],[18,72,18,73],[33,90,33,91],[25,74,25,76],[25,72,25,73],[32,78,32,79],[6,35,7,35],[6,36,7,36],[6,37,7,37],[6,38,7,38],[12,44,13,46],[24,74,24,76],[22,74,22,76],[23,74,23,76],[20,74,20,76],[21,74,21,76],[12,84,12,85],[13,84,13,85],[14,88,14,89],[117,239,117,241],[117,242,117,244],[11,138,11,139],[12,138,12,139],[13,138,13,139],[14,138,14,139],[18,80,18,82],[12,88,12,89],[12,90,12,92],[12,93,12,95],[12,96,12,98],[12,99,12,101],[12,102,12,104],[12,105,12,107],[13,90,13,91],[14,90,14,91],[15,90,15,91],[16,90,16,91],[17,90,17,91],[13,96,13,98],[14,96,14,98],[16,88,16,89],[13,88,13,89],[15,88,15,89],[17,99,17,100],[27,191,27,193],[28,194,28,196],[63,188,63,190],[28,183,28,184],[47,183,48,190],[55,185,55,187],[34,200,35,203],[137,237,137,238],[139,237,139,238],[139,239,139,241],[139,242,139,244],[139,245,139,247],[143,245,143,247],[144,237,144,238],[144,239,144,241],[144,242,144,244],[144,245,144,247],[131,237,131,238],[131,239,131,241],[131,242,131,244],[118,242,118,244],[118,245,118,247],[18,74,18,76],[19,74,19,76],[34,183,34,184],[35,183,35,184],[36,183,36,184],[37,183,37,184],[38,183,38,184],[39,183,39,184],[40,183,40,184],[41,183,41,184],[44,183,44,184],[45,183,45,184],[62,183,62,184],[63,183,63,184],[58,183,58,184],[58,185,58,187],[58,188,58,190],[149,239,149,241],[149,242,149,244],[140,237,140,238],[140,239,140,241],[140,242,140,244],[140,245,140,247],[141,237,141,238],[141,239,141,241],[141,242,141,244],[141,245,141,247],[142,237,142,238],[142,239,142,241],[142,242,142,244],[142,245,142,247],[143,237,143,238],[143,239,143,241],[143,242,143,244],[145,237,145,238],[145,239,145,241],[145,242,145,244],[145,245,145,247],[146,237,146,238],[146,239,146,241],[146,242,146,244],[146,245,146,247],[147,237,147,238],[147,239,147,241],[147,242,147,244],[147,245,147,247],[148,237,148,238],[148,239,148,241],[148,242,148,244],[107,245,107,247],[108,239,108,241],[108,242,108,247],[109,237,109,238],[109,239,109,241],[109,242,109,244],[109,245,109,247],[110,237,110,238],[110,239,110,241],[110,242,110,244],[110,245,110,247],[111,237,111,238],[111,239,111,241],[111,242,111,244],[116,237,116,238],[116,239,116,241],[116,242,116,244],[116,245,116,247],[112,245,112,247],[113,237,113,238],[113,239,113,241],[113,242,113,244],[113,245,113,247],[114,237,114,238],[114,239,114,241],[127,249,127,251],[128,237,128,238],[128,239,128,241],[128,242,128,244],[128,245,128,247],[128,249,128,251],[134,237,134,238],[134,239,134,241],[134,242,134,244],[133,237,133,238],[133,239,133,241],[127,237,127,238],[127,239,127,241],[127,242,127,247],[129,237,129,238],[129,239,129,241],[130,237,130,238],[130,239,130,241],[130,242,130,244],[130,245,130,247],[131,245,131,247],[133,242,133,244],[133,245,133,247],[102,237,102,238],[102,239,102,241],[102,242,102,244],[102,245,102,247],[103,237,103,238],[103,239,103,241],[167,200,167,201],[167,202,167,204],[167,205,167,207],[167,208,167,210],[168,200,168,201],[168,202,168,204],[168,205,168,207],[168,208,168,210],[161,200,161,201],[161,202,161,204],[111,245,111,247],[112,237,112,238],[112,239,112,241],[112,242,112,244],[118,237,118,238],[118,239,118,241],[129,245,129,247],[137,239,137,241],[137,242,137,244],[137,245,137,247],[138,239,138,241],[149,212,149,214],[136,245,136,247],[107,237,107,238],[107,239,107,241],[107,242,107,244],[97,249,97,251],[98,237,98,238],[98,239,98,241],[98,242,98,244],[98,245,98,247],[98,249,98,251],[99,237,99,238],[99,239,99,241],[99,242,99,244],[99,245,99,247],[100,237,100,238],[100,239,100,241],[100,242,100,244],[100,245,100,247],[101,237,101,238],[101,239,101,241],[101,242,101,244],[101,245,101,247],[97,237,97,238],[97,239,97,241],[97,242,97,247],[150,212,150,214],[162,200,162,201],[162,202,162,204],[162,205,162,207],[162,208,162,210],[163,200,163,201],[163,202,163,204],[163,205,163,207],[163,208,163,210],[164,200,164,201],[164,202,164,204],[166,205,166,207],[166,208,166,210],[157,200,157,201],[157,202,157,204],[157,205,157,207],[157,208,157,210],[158,200,158,201],[158,202,158,204],[158,205,158,207],[161,205,161,207],[161,208,161,210],[152,200,152,201],[152,202,152,204],[152,205,152,207],[152,208,152,210],[153,200,153,201],[153,202,153,204],[153,205,153,207],[153,208,153,210],[156,202,156,204],[156,200,156,201],[142,200,142,201],[142,202,142,204],[142,205,142,207],[142,208,142,210],[138,200,138,201],[138,202,138,204],[138,205,138,207],[138,208,138,210],[139,200,139,201],[139,202,139,204],[139,205,139,207],[139,208,139,210],[154,205,154,207],[154,208,154,210],[143,202,143,204],[143,205,143,207],[146,200,147,203],[154,200,154,201],[154,202,154,204],[140,200,140,201],[140,202,140,204],[140,205,140,207],[150,208,150,210],[151,200,151,201],[151,202,151,204],[151,205,151,207],[151,208,151,210],[149,200,149,201],[150,205,150,207],[131,208,131,210],[132,202,132,204],[132,205,132,210],[133,200,133,201],[133,202,133,204],[133,205,133,207],[133,208,133,210],[134,200,134,201],[134,202,134,204],[134,205,134,207],[134,208,134,210],[135,200,135,201],[135,202,135,204],[135,205,135,207],[135,208,135,210],[141,200,141,201],[141,202,141,204],[141,205,141,207],[141,208,141,210],[136,200,136,201],[136,202,136,204],[136,205,136,207],[136,208,136,210],[137,200,137,201],[137,202,137,204],[137,205,137,207],[137,208,137,210],[140,208,140,210],[131,200,131,201],[131,202,131,204],[131,205,131,207],[126,202,126,204],[126,205,126,207],[126,208,126,210],[127,200,127,201],[127,202,127,204],[127,205,127,207],[127,208,127,210],[128,200,128,201],[128,202,128,204],[128,205,128,207],[128,208,128,210],[129,200,129,201],[129,202,129,204],[129,205,129,207],[129,208,129,210],[130,200,130,201],[130,202,130,204],[130,205,130,207],[130,208,130,210],[126,200,126,201],[111,200,111,201],[111,202,111,204],[111,205,111,207],[111,208,111,210],[112,200,112,201],[112,202,112,204],[112,205,112,207],[112,208,112,210],[113,200,113,201],[113,202,113,204],[113,205,113,207],[113,208,113,210],[123,208,123,210],[124,208,124,210],[125,200,125,201],[125,202,125,204],[125,205,125,207],[125,208,125,210],[121,200,121,201],[121,202,121,204],[122,200,122,201],[122,202,122,204],[123,200,123,201],[123,202,123,204],[124,200,124,201],[124,202,124,204],[124,205,124,207],[114,202,114,204],[114,205,114,207],[118,200,119,203],[106,200,106,201],[106,202,106,204],[106,205,106,207],[106,208,106,210],[107,200,107,201],[107,202,107,204],[107,205,107,207],[107,208,107,210],[108,200,108,201],[108,202,108,204],[108,205,108,207],[108,208,108,210],[109,200,109,201],[109,202,109,204],[109,205,109,207],[109,208,109,210],[110,200,110,201],[110,202,110,204],[110,205,110,207],[110,208,110,210],[97,202,97,204],[97,205,97,207],[97,208,97,210],[98,200,98,201],[98,202,98,204],[98,205,98,207],[98,208,98,210],[99,200,99,201],[99,202,99,204],[99,205,99,207],[99,208,99,210],[100,200,100,201],[100,202,100,204],[100,205,100,207],[100,208,100,210],[105,205,105,207],[105,208,105,210],[101,200,101,201],[101,202,101,204],[101,205,101,207],[101,208,101,210],[102,200,102,201],[104,200,104,201],[105,200,105,201],[104,202,104,204],[105,202,105,204],[102,202,102,204],[103,202,103,204],[102,205,102,207],[102,208,102,210],[103,205,103,210],[92,205,92,210],[93,200,93,201],[93,202,93,204],[93,205,93,207],[93,208,93,210],[94,200,94,201],[94,202,94,204],[94,205,94,207],[94,208,94,210],[95,200,95,201],[95,202,95,204],[95,205,95,207],[95,208,95,210],[86,202,86,204],[86,205,86,207],[96,200,96,201],[96,202,96,204],[96,205,96,207],[96,208,96,210],[89,200,90,203],[82,202,82,204],[82,205,82,207],[82,208,82,210],[83,200,83,201],[83,202,83,204],[83,205,83,207],[83,208,83,210],[84,200,84,201],[84,202,84,204],[84,205,84,207],[84,208,84,210],[59,209,59,210],[59,211,59,213],[59,215,59,216],[58,244,58,246],[58,247,58,249],[80,205,80,207],[80,208,80,210],[81,200,81,201],[81,202,81,204],[81,205,81,207],[81,208,81,210],[77,200,77,201],[77,202,77,204],[77,205,77,207],[58,217,58,219],[58,220,58,222],[58,223,58,225],[58,226,58,228],[58,229,58,231],[58,232,58,234],[58,238,58,240],[57,217,57,219],[57,220,57,222],[57,223,57,225],[57,226,57,228],[57,229,57,231],[57,232,57,234],[57,235,57,237],[57,238,57,240],[57,241,57,243],[57,244,57,246],[57,247,57,249],[57,250,57,252],[75,202,75,204],[76,200,76,201],[76,202,76,204],[76,205,76,207],[76,208,76,210],[70,200,70,201],[70,202,70,204],[70,205,70,207],[70,208,70,210],[72,200,72,201],[72,202,72,204],[68,202,68,204],[68,205,68,207],[68,208,68,210],[69,200,69,201],[69,202,69,204],[69,205,69,207],[69,208,69,210],[66,202,66,204],[66,205,66,207],[58,241,58,243],[80,200,80,201],[80,202,80,204],[58,250,58,252],[64,205,64,210],[71,200,71,201],[71,205,71,207],[71,208,71,210],[75,205,75,210],[72,205,72,207],[72,208,72,210],[73,200,73,201],[73,202,73,204],[73,205,73,207],[73,208,73,210],[67,200,67,201],[67,202,67,204],[67,205,67,207],[67,208,67,210],[68,200,68,201],[61,200,62,203],[85,202,85,204],[85,205,85,207],[85,208,85,210],[92,200,92,201],[92,202,92,204],[59,217,59,219],[59,221,59,222],[59,223,59,225],[59,227,59,228],[59,229,59,231],[59,233,59,234],[59,235,59,237],[59,239,59,240],[59,241,59,243],[58,200,58,201],[58,202,58,204],[58,205,58,207],[58,208,58,210],[58,211,58,213],[78,200,78,201],[78,202,78,204],[78,205,78,207],[78,208,78,210],[79,200,79,201],[79,202,79,204],[79,205,79,207],[79,208,79,210],[74,200,74,201],[74,202,74,204],[74,205,74,207],[74,208,74,210],[58,235,58,237],[55,217,55,219],[55,220,55,222],[55,223,55,225],[55,226,55,228],[55,229,55,231],[55,232,55,234],[55,235,55,237],[55,238,55,240],[55,241,55,243],[55,244,55,246],[55,247,55,249],[55,250,55,252],[56,217,56,219],[56,220,56,222],[56,223,56,225],[56,226,56,228],[56,229,56,231],[56,232,56,234],[56,235,56,237],[56,238,56,240],[56,241,56,243],[56,244,56,246],[56,247,56,249],[56,250,56,252],[53,217,53,219],[53,220,53,222],[53,223,53,225],[53,226,53,228],[53,229,53,231],[53,232,53,234],[53,235,53,237],[53,238,53,240],[53,241,53,243],[53,244,53,246],[53,247,53,249],[53,250,53,252],[54,217,54,219],[54,220,54,222],[54,223,54,225],[54,226,54,228],[54,229,54,231],[54,232,54,234],[54,235,54,237],[54,238,54,240],[54,241,54,243],[54,244,54,246],[54,247,54,249],[54,250,54,252],[51,217,51,219],[51,220,51,222],[51,223,51,225],[51,226,51,228],[51,229,51,231],[51,232,51,234],[51,235,51,237],[51,238,51,240],[51,241,51,243],[51,244,51,246],[51,247,51,249],[51,250,51,252],[52,217,52,219],[52,220,52,222],[52,223,52,225],[52,226,52,228],[52,229,52,231],[52,232,52,234],[52,235,52,237],[52,238,52,240],[52,241,52,243],[52,244,52,246],[52,247,52,249],[52,250,52,252],[49,217,49,219],[49,220,49,222],[49,223,49,225],[49,226,49,228],[49,229,49,231],[49,232,49,234],[49,235,49,237],[49,238,49,240],[49,241,49,243],[49,244,49,246],[49,247,49,249],[49,250,49,252],[50,217,50,219],[50,220,50,222],[50,223,50,225],[50,226,50,228],[50,229,50,231],[50,232,50,234],[50,235,50,237],[50,238,50,240],[50,241,50,243],[50,244,50,246],[50,247,50,249],[50,250,50,252],[47,220,47,222],[47,223,47,225],[47,226,47,228],[47,229,47,231],[47,232,47,234],[47,235,47,237],[47,238,47,240],[47,241,47,243],[47,244,47,246],[47,247,47,249],[47,250,47,252],[48,217,48,222],[48,223,48,228],[48,229,48,234],[48,235,48,240],[48,241,48,246],[48,247,48,252],[44,250,44,252],[45,217,45,219],[45,220,45,222],[45,223,45,225],[45,226,45,228],[45,229,45,231],[45,232,45,234],[45,235,45,237],[45,238,45,240],[45,241,45,243],[45,244,45,246],[45,247,45,249],[45,250,45,252],[44,217,44,219],[44,220,44,222],[44,223,44,225],[46,229,46,231],[46,232,46,234],[46,235,46,237],[46,238,46,240],[46,241,46,243],[46,244,46,246],[46,247,46,249],[46,250,46,252],[57,202,57,204],[39,250,39,252],[40,244,40,246],[40,247,40,249],[40,250,40,252],[41,217,41,219],[41,220,41,222],[41,223,41,225],[41,226,41,228],[41,229,41,231],[41,232,41,234],[41,235,41,237],[41,238,41,240],[41,241,41,243],[41,244,41,246],[41,247,41,249],[41,250,41,252],[42,235,42,237],[42,238,42,240],[42,241,42,243],[42,244,42,246],[42,247,42,249],[42,250,42,252],[43,247,43,249],[43,250,43,252],[44,226,44,228],[44,229,44,231],[42,202,42,204],[42,205,42,207],[42,208,42,210],[42,211,42,213],[42,214,42,216],[47,200,47,201],[47,202,47,204],[44,235,44,237],[44,238,44,240],[46,200,46,201],[46,205,46,207],[46,208,46,210],[46,211,46,213],[44,200,44,201],[45,200,45,201],[45,205,45,207],[44,202,44,204],[45,202,45,204],[55,211,55,213],[55,214,55,216],[54,202,54,204],[54,205,54,207],[52,208,52,210],[52,211,52,213],[52,214,52,216],[51,211,51,213],[51,214,51,216],[49,200,49,201],[49,202,49,204],[50,200,50,201],[50,202,50,204],[51,200,51,201],[52,200,52,201],[52,202,52,204],[54,211,54,213],[55,202,55,204],[47,217,47,219],[43,200,43,201],[43,202,43,204],[43,205,43,207],[43,208,43,210],[43,211,43,213],[43,214,43,216],[46,202,46,204],[37,205,37,210],[37,211,37,216],[37,217,37,222],[37,223,37,228],[37,229,37,234],[40,217,40,219],[40,220,40,222],[40,223,40,225],[40,226,40,228],[40,229,40,231],[40,232,40,234],[42,217,42,219],[42,220,42,222],[42,223,42,225],[42,226,42,228],[44,232,44,234],[46,217,46,219],[46,220,46,222],[46,223,46,225],[46,226,46,228],[39,200,39,201],[39,202,39,204],[39,205,39,207],[39,208,39,210],[39,217,39,219],[39,220,39,222],[39,223,39,225],[39,226,39,228],[39,229,39,231],[39,232,39,234],[39,235,39,237],[39,238,39,240],[31,250,31,252],[38,241,38,243],[38,244,38,246],[38,247,38,249],[38,250,38,252],[32,211,32,213],[32,209,32,210],[32,215,32,216],[32,217,32,219],[32,221,32,222],[32,223,32,225],[32,227,32,228],[32,229,32,231],[32,233,32,234],[32,235,32,237],[32,239,32,240],[32,241,32,243],[32,245,32,246],[32,247,32,249],[104,237,104,238],[104,239,104,241],[104,242,104,244],[104,245,104,247],[38,214,38,216],[44,208,44,210],[44,211,44,213],[44,214,44,216],[45,208,45,210],[45,211,45,213],[45,214,45,216],[38,217,38,219],[38,220,38,222],[38,223,38,225],[38,226,38,228],[38,229,38,231],[57,211,57,213],[59,245,59,246],[59,247,59,249],[39,241,39,243],[39,244,39,246],[39,247,39,249]],"merged_total":3083,"flags":["merged_cut"]}
[]
[null,"DATABASE 1",null,null,null,null,null,null,null,null,null,null,null,null,null,null,null,null,null,null,null,null,null,null,null,null,null,null,null,null,null,null,null,null,null,null,null,null,null,null,null,null,null,null,null,null,null,null,null,null,null,null,null,"DATABASE 2",null,null,null,null,null,null,null,null,null,null,null,null,null,null,null,null,null,"INPUTS",null,null,null,null,null,null,null,null,null,null,null,null,null,null,null,null,null,null,null,null,null,null,null,null,null,null,null,null,null,null,null,null,null,null,null,null,null,null,null,null,null,"MODULE 1",null,null,null,null,null,null,null,null,null,null,null,null,null,null,null,null,null,null,null,null,null,null,null,null,null,null,null,null,null,null,null,null,null,null,null,null,null,null,null,null,null,null,null,null,null,null,null,null,null,null,null,null,null,null,null,null,null,null,null,null,null,null,null,null,null,null,null,null,"MODULE 2",null,null,null,null,null,null,null,null,null,null,null,null,null,null,null,null,"MODULE 3",null,null,null,null,null,null,null,null,null,null,null,null,null,null,null,null,null,null,null,null,null,null,null,null,null,null,null,null,null,null,null,null,null,null,null,null,null,null,null,null,null,null,null,null,null,null,null,null,null,null,null,null,null,null,null,"MODULE 4",null,null,null,null,null,null,null,null,null,null,null,null,null,null,null,null,null,null,null,null,null,null,null,null,null,null,null,null,null,null,null,null,null,null,null,null,null,null,null,null,null,null,null,null,null,null,"MODULE 5"]
[]
[]
[]
[null,null,1,2,3,4,5,6,7,8,9,10,11,12,13,14,15,16,17,18,19,20,21,22,23,24,25,26,27,28,29,30,31,32,33,34,35,36,37]
[null,null,"Ref.","Material","Type","e","λ or R","λ or R value","λ ","R","Ref","Ucons",null,"Ucost",null,"ADPE",null,"ADPF",null,"AP",null,"EP",null,"POCP",null,"GWP",null,"ODP",null,"FL",null,"SD",null,"ST",null,"F1","F2","F3","F4",null,"Assistant",null,null,null,null,null,null,null,null,null,null,null,null,null,"PORTUGAL",null,null,null,null,null,null,null,null,null,null,"OTHERS",null,null,null,null,null,null,null,null,null,null,null,null,null,null,null,null,null,null,null,null,null,null,null,null,null,null,null,null,null,null,null,null,null,null,null,null,null,null,null,null,null,null,null,null,null,null,null,null,"SOLUTION A",null,null,null,null,null,null,null,null,null,null,null,null,null,null,null,null,null,null,null,null,null,null,null,null,null,null,null,null,null,null,null,null,null,null,null,null,null,null,null,null,null,null,null,null,null,null,null,null,null,null,null,null,null,null,null,null,null,null,null,null,null,null,null,null,null,null,null,null,"PORTUGAL",null,null,null,null,null,null,null,null,null,null,null,null,null,null,null,null,null,null,null,null,null,null,null,null,null,null,null,null,null,null,null,null,null,null,null,null,null,null,null,null,null,null,null,null,null,null,null,null,null,null,null,null,null,null,null,null,null,null,null,null,null,null,null,null,null,null,null,null,null,null,null,null,"SOLUTION A",null,null,null,null,null,null,null,null,null,null,null,null,null,null,null,null,null,null,null,null,null,null,null,null,null,null,null,null,null,null,null,null,null,null,null,null,null,null,null,null,null,null,null,null,null,null,"WEIGHTS (MODULES)"]
[null,null,null,null,null,null,null,null,null,null,null,null,null,null,null,null,null,null,null,null,null,null,null,null,null,null,null,null,null,null,null,null,null,null,null,null,null,null,null,null,null,null,null,null,null,null,null,null,null,null,null,null,null,null,"Municipality","Ref",null,"Region","REF",null,"HEATING SEASON",null,"COOLING SEASON",null,null,"#","Local","HDD","CDD",null,null,null,"SOLUTION A",null,null,null,null,null,null,null,null,null,null,null,null,null,null,null,null,null,null,null,null,null,null,null,null,null,null,null,null,null,null,null,null,null,null,null,null,null,null,null,null,null,null,null,null,null,null,null,null,null,null,null,null,null,null,null,null,null,null,null,null,null,null,null,null,null,null,null,null,null,null,null,null,null,null,null,null,null,null,null,null,null,null,null,null,null,null,null,null,null,null,null,null,null,null,null,null,null,null,null,null,null,null,null,null,null,null,null,null,null,null,null,null,null,null,null,null,null,null,null,null,null,null,null,null,null,null,null,"INDICATORS VALUE A"]
[null,null,1,{"$f":"Mat_DB!D12","v":"---"},"---","---",null,"---","---","---","---","---","---","---",{"$f":"IF($AM9=1,$AO$10,IF($AM9=2,$AO$11,\"---\"))","v":"---"},"---",{"$f":"IF($AM9=1,$AP$10,IF($AM9=2,$AP$11,\"---\"))","v":"---"},"---",{"$f":"IF($AM9=1,$AQ$10,IF($AM9=2,$AQ$11,\"---\"))","v":"---"},"---",{"$f":"IF($AM9=1,$AR$10,IF($AM9=2,$AR$11,\"---\"))","v":"---"},"---",{"$f":"IF($AM9=1,$AS$10,IF($AM9=2,$AS$11,\"---\"))","v":"---"},"---",{"$f":"IF($AM9=1,$AT$10,IF($AM9=2,$AT$11,\"---\"))","v":"---"},"---",{"$f":"IF($AM9=1,$AU$10,IF($AM9=2,$AU$11,\"---\"))","v":"---"},"---",{"$f":"IF($AM9=1,$AV$10,IF($AM9=2,$AV$11,\"---\"))","v":"---"},"---",{"$f":"IF($AM9=1,$AW$10,IF($AM9=2,$AW$11,\"---\"))","v":"---"},"---",{"$f":"IF($AM9=1,$AX$10,IF($AM9=2,$AX$11,\"---\"))","v":"---"},"---",{"$f":"IF($AM9=1,$AY$10,IF($AM9=2,$AY$11,\"---\"))","v":"---"},0,0,0,0,null,"---","---","---","---","---","---","---","---","---","---","---",null,null,null,null,null,null,null,null,"z","GD",null,"θext,v",null,null,1,{"$f":"Loc_DB!G12","v":"---"},{"$f":"Loc_DB!J12","v":"---"},{"$f":"Loc_DB!N12","v":"---"},null,null,null,null,null,null,null,null,null,null,null,null,null,null,null,null,null,null,null,null,null,null,null,null,null,null,null,null,null,null,null,null,null,null,null,null,null,null,null,null,null,null,null,null,null,null,null,null,null,null,null,null,null,null,null,null,null,null,null,null,null,null,null,null,null,null,null,null,null,null,null,null,null,null,null,null,null,null,null,null,null,null,null,null,null,null,null,null,null,null,null,null,null,null,null,null,null,null,null,null,null,null,null,null,null,null,null,null,null,null,null,null,null,null,null,null,"SOLUTION A",null,null,"SOLUTION B",null,null,null,null,"SOLUTION A",null,"SOLUTION B",null,null,null,null,null,null,null,null,null,null,null,null,null,null,null,null,null,null,null,null,null,null,null,null,null,null,null,null,null,null,null,null,null,null,null,null,null,null,null,null,null,null,null,null,null,null,null,null,null,null,null,null,null,null,null,null,null,null,null,null,null,null,null,null,null,null,null,null,null,null,null,null,null,null,null,null,null,null,null,null,null,null,null,null,null,null,null,null,null,null,null,null,null,null,null,null,null,null,null,null,null,null,null,null,null,null,null,"MODULE 1",null,0]
[null,null,{"$f":"C9+1","v":2},{"$f":"Mat_DB!D13","v":"Gypsum Board (6 mm) [Gyptec]"},{"$f":"Mat_DB!H13","v":"Sheathing Panel"},{"$f":"Mat_DB!J13","v":6},{"$f":"Mat_DB!L13","v":"λ [W/(m·K)]"},{"$f":"Mat_DB!K13","v":0.2},{"$f":"IF(AK10=1,\"---\",IF(AK10=2,H10,\"---\"))","v":0.2},{"$f":"IF(AK10=2,\"---\",IF(AK10=1,H10,\"---\"))","v":"---"},{"$f":"Mat_DB!M13","v":"Gyptec"},{"$f":"IF(Mat_DB!O13=\"\",\"---\",Mat_DB!O13)","v":1},{"$f":"IF(Mat_DB!P13=\"\",\"---\",Mat_DB!P13)","v":"m²/m²"},{"$f":"IF(Mat_DB!Q13=\"\",\"---\",Mat_DB!Q13)","v":5.03},"€/m²",{"$f":"Mat_DB!T13","v":2.4479999999999997E-7},"kg SB-eq/m²",{"$f":"Mat_DB!U13","v":0.16799999999999998},"MJ/m²",{"$f":"Mat_DB!V13","v":5.7599999999999995E-3},"kg SO2-eq/m²",{"$f":"Mat_DB!W13","v":5.2800000000000004E-4},"kg (PO4)3-eq/m²",{"$f":"Mat_DB!X13","v":4.5119999999999996E-4},"kg C2H4-eq/m²",{"$f":"Mat_DB!Y13","v":1.2},"kg CO2-eq/m²",{"$f":"Mat_DB!Z13","v":2.9280000000000001E-8},"kg CFC11-eq/m²",{"$f":"Mat_DB!AC13","v":"---"},"mm",{"$f":"Mat_DB!AD13","v":"---"},"mm",{"$f":"Mat_DB!AE13","v":"---"},"mm",1,{"$f":"IF(G10=$CS$67,1,IF(G10=$CS$68,2,\"---\"))","v":2},{"$f":"IF(E10=$CW$67,1,IF(E10=$CW$68,2,IF(E10=$CW$69,3,IF(E10=$CW$70,4,IF(E10=$CW$71,5,IF(E10=$CW$72,6,IF(E10=$CW$73,7,\"---\")))))))","v":5},{"$f":"IF(M10=$DA$67,1,IF(M10=$DA$68,2,\"---\"))","v":2},null,"€/m","kg SB-eq/m","MJ/m","kg SO2-eq/m","kg (PO4)3-eq/m","kg C2H4-eq/m","kg CO2-eq/m","kg CFC11-eq/m","mm","mm","mm",null,null,null,null,null,null,null,null,"REF","REF","a","REF","a",null,{"$f":"BN9+1","v":2},{"$f":"Loc_DB!G13","v":"Copenhagen_DK"},{"$f":"Loc_DB!J13","v":6272},{"$f":"Loc_DB!N13","v":0},null,null,null,null,null,null,null,null,null,null,null,null,null,null,null,null,null,null,null,null,null,null,null,null,null,null,null,null,null,null,null,null,null,null,null,null,null,null,null,null,null,null,null,null,null,"WALL",null,null,null,null,null,"AREA FACTORS",null,null,null,null,null,"R-VALUE | U-VALUE",null,null,null,null,null,null,null,null,null,null,null,null,null,null,null,null,null,null,null,null,null,null,null,null,null,null,null,null,null,null,null,null,null,null,null,null,null,null,null,null,null,null,null,null,null,null,null,null,null,null,null,null,null,null,null,null,"#",null,{"$f":"VLOOKUP($BW$14,$BC$9:$BD$319,2)","v":10},null,null,{"$f":"VLOOKUP($BW$34,$BC$9:$BD$319,2)","v":10},null,null,null,"HDD",{"$f":"GD18","v":1312},null,{"$f":"GG18","v":1312},null,null,null,null,null,null,null,null,null,null,null,null,null,null,null,null,null,null,null,null,null,null,null,null,null,null,null,null,null,null,null,null,null,null,null,null,null,null,null,null,null,null,null,null,null,null,null,null,null,null,null,null,null,null,null,null,null,null,null,null,null,null,"Material 1",null,null,"Unit Cost",null,null,null,null,null,"Unit Consumption",null,null,null,null,null,"Material 2",null,null,"Unit Cost",null,null,null,null,null,"Unit Consumption",null,null,null,null,null,"Custo 1",null,null,"Custo 2",null,null,null,"COST A",null,null,null,null,null,null,null,"MODULE 2",null,{"$f":"BW52","v":0.35}]
[null,null,{"$f":"C10+1","v":3},{"$f":"Mat_DB!D14","v":"Gypsum Board (9,5 mm) [Gyptec]"},{"$f":"Mat_DB!H14","v":"Sheathing Panel"},{"$f":"Mat_DB!J14","v":9.5},{"$f":"Mat_DB!L14","v":"λ [W/(m·K)]"},{"$f":"Mat_DB!K14","v":0.2},{"$f":"IF(AK11=1,\"---\",IF(AK11=2,H11,\"---\"))","v":0.2},{"$f":"IF(AK11=2,\"---\",IF(AK11=1,H11,\"---\"))","v":"---"},{"$f":"Mat_DB!M14","v":"Gyptec"},{"$f":"IF(Mat_DB!O14=\"\",\"---\",Mat_DB!O14)","v":1},{"$f":"IF(Mat_DB!P14=\"\",\"---\",Mat_DB!P14)","v":"m²/m²"},{"$f":"IF(Mat_DB!Q14=\"\",\"---\",Mat_DB!Q14)","v":3.51},"€/m²",{"$f":"Mat_DB!T14","v":3.876E-7},"kg SB-eq/m²",{"$f":"Mat_DB!U14","v":0.26599999999999996},"MJ/m²",{"$f":"Mat_DB!V14","v":9.1199999999999996E-3},"kg SO2-eq/m²",{"$f":"Mat_DB!W14","v":8.3600000000000005E-4},"kg (PO4)3-eq/m²",{"$f":"Mat_DB!X14","v":7.1440000000000002E-4},"kg C2H4-eq/m²",{"$f":"Mat_DB!Y14","v":1.9},"kg CO2-eq/m²",{"$f":"Mat_DB!Z14","v":4.6360000000000006E-8},"kg CFC11-eq/m²",{"$f":"Mat_DB!AC14","v":"---"},"mm",{"$f":"Mat_DB!AD14","v":"---"},"mm",{"$f":"Mat_DB!AE14","v":"---"},"mm",1,{"$f":"IF(G11=$CS$67,1,IF(G11=$CS$68,2,\"---\"))","v":2},{"$f":"IF(E11=$CW$67,1,IF(E11=$CW$68,2,IF(E11=$CW$69,3,IF(E11=$CW$70,4,IF(E11=$CW$71,5,IF(E11=$CW$72,6,IF(E11=$CW$73,7,\"---\")))))))","v":5},{"$f":"IF(M11=$DA$67,1,IF(M11=$DA$68,2,\"---\"))","v":2},null,"€/m²","kg SB-eq/m²","MJ/m²","kg SO2-eq/m²","kg (PO4)3-eq/m²","kg C2H4-eq/m²","kg CO2-eq/m²","kg CFC11-eq/m²","mm","mm","mm",null,null,null,"---",0,null,null,null,"m","⁰C","⁰C/km","⁰C","⁰C/km",null,3,{"$f":"Loc_DB!G14","v":"Helsinki_FI"},{"$f":"Loc_DB!J14","v":4854},{"$f":"Loc_DB!N14","v":4},null,null,null,"Building Features 1",null,null,null,null,null,"Building Features 2",null,null,null,null,null,"Location",null,null,null,"Wall Composition",null,null,null,null,null,null,null,null,null,null,null,null,null,null,null,null,null,null,null,null,null,null,null,null,null,null,null,null,null,null,null,null,null,null,null,null,null,null,null,null,null,null,null,null,null,null,null,null,null,null,null,null,null,null,null,null,null,null,null,null,null,null,null,null,null,null,null,null,null,null,null,null,null,null,null,null,null,null,null,null,null,null,null,null,null,null,null,null,null,null,null,null,null,null,"L",null,{"$f":"BW14","v":"Coimbra"},null,null,{"$f":"BW34","v":"Coimbra"},null,null,null,"CDD",{"$f":"(25-GD19)*2928/24","v":500.20000000000022},null,{"$f":"(25-GG19)*2928/24","v":500.20000000000022},null,null,null,null,"Layers",null,"Material 1",null,null,"Unit Consumption",null,null,null,null,null,"Indicator",null,null,null,null,null,"Indicator",null,null,null,null,null,"Indicator",null,null,null,null,null,"Indicator",null,null,null,null,null,"Indicator",null,null,null,null,null,"Indicator",null,null,null,null,null,"Indicator",null,null,null,null,null,null,null,null,"LAYER 1",null,{"$f":"CM14","v":"Gypsum Board (12,5 mm) [Gyptec]"},null,null,{"$f":"VLOOKUP(CO14,$C$9:$AV$61,12)","v":3.25},null,null,{"$f":"VLOOKUP(CO14,$C$9:$AV$61,13)","v":"€/m²"},null,null,{"$f":"IF(VLOOKUP(CO14,$C$9:$AV$61,36)=7,1,VLOOKUP(CO14,$C$9:$AV$61,10))","v":1},null,null,{"$f":"VLOOKUP(CO14,$C$9:$AV$61,11)","v":"m²/m²"},null,null,{"$f":"CV14","v":"---"},null,null,{"$f":"VLOOKUP(CX14,$C$9:$AV$61,12)","v":"---"},null,null,{"$f":"VLOOKUP(CX14,$C$9:$AV$61,13)","v":"---"},null,null,{"$f":"IF(VLOOKUP(CX14,$C$9:$AV$61,36)=1,$AP$17,IF(VLOOKUP(CX14,$C$9:$AV$61,36)=6,$AP$17,VLOOKUP(CX14,$C$9:$AV$61,10)))","v":"---"},null,null,{"$f":"VLOOKUP(CX14,$C$9:$AV$61,11)","v":"---"},null,null,{"$f":"IF(CO14=1,0,JB11*JH11)","v":3.25},null,null,{"$f":"IF(CX14=1,0,JQ11*JW11)","v":0},null,null,null,null,null,null,null,null,null,null,null,"MODULE 3",null,{"$f":"BW53","v":0.15}]
[null,null,{"$f":"C11+1","v":4},{"$f":"Mat_DB!D15","v":"Gypsum Board (12,5 mm) [Gyptec]"},{"$f":"Mat_DB!H15","v":"Sheathing Panel"},{"$f":"Mat_DB!J15","v":12.5},{"$f":"Mat_DB!L15","v":"λ [W/(m·K)]"},{"$f":"Mat_DB!K15","v":0.17499999999999999},0.17499999999999999,"---",{"$f":"Mat_DB!M15","v":"Gyptec"},{"$f":"IF(Mat_DB!O15=\"\",\"---\",Mat_DB!O15)","v":1},{"$f":"IF(Mat_DB!P15=\"\",\"---\",Mat_DB!P15)","v":"m²/m²"},{"$f":"IF(Mat_DB!Q15=\"\",\"---\",Mat_DB!Q15)","v":3.25},"€/m²",{"$f":"Mat_DB!T15","v":5.0999999999999999E-7},"kg SB-eq/m²",{"$f":"Mat_DB!U15","v":0.35},"MJ/m²",{"$f":"Mat_DB!V15","v":1.2E-2},"kg SO2-eq/m²",{"$f":"Mat_DB!W15","v":1.1000000000000001E-3},"kg (PO4)3-eq/m²",{"$f":"Mat_DB!X15","v":9.3999999999999997E-4},"kg C2H4-eq/m²",{"$f":"Mat_DB!Y15","v":2.5},"kg CO2-eq/m²",{"$f":"Mat_DB!Z15","v":6.1000000000000004E-8},"kg CFC11-eq/m²",{"$f":"Mat_DB!AC15","v":"---"},"mm",{"$f":"Mat_DB!AD15","v":"---"},"mm",{"$f":"Mat_DB!AE15","v":"---"},"mm",1,2,5,2,null,null,null,null,null,null,null,null,null,null,null,null,null,null,null,"Abrantes",20,null,null,null,null,null,null,null,null,null,4,{"$f":"Loc_DB!G15","v":"Minsk_BY"},{"$f":"Loc_DB!J15","v":4452},{"$f":"Loc_DB!N15","v":5},null,null,null,null,null,null,null,null,null,null,null,null,null,null,null,null,null,null,null,null,null,null,null,null,null,null,null,null,null,null,null,null,null,null,null,null,null,null,null,null,null,null,null,null,null,"SD",null,{"$f":"VLOOKUP($CE$20,$C$9:$AV$61,30)*0.001","v":0.09},{"$f":"VLOOKUP(#REF!,$C$9:$AV$61,7)","v":{"$error":"#REF!"}},{"$f":"VLOOKUP(#REF!,$C$9:$AV$61,7)","v":{"$error":"#REF!"}},null,"F_FL_W",null,{"$f":"DM15/DM17","v":0.46739130434782611},null,null,null,"CHOSEN METHOD",null,{"$f":"SA_UCalc!H26","v":1},null,null,null,null,null,null,null,null,null,null,null,null,null,null,null,null,null,null,null,null,null,null,null,null,null,null,null,null,null,null,null,null,null,null,null,null,null,null,null,null,null,null,null,null,null,null,null,null,null,null,null,null,null,null,"ALT",null,{"$f":"$BW$15*0.001","v":7.4999999999999997E-2},null,null,{"$f":"$BW$35*0.001","v":7.4999999999999997E-2},null,null,null,null,null,null,null,null,null,null,null,"LAYER 1",null,{"$f":"CM14","v":"Gypsum Board (12,5 mm) [Gyptec]"},null,null,{"$f":"IF(VLOOKUP(CO14,$C$9:$AV$61,36)=7,1,VLOOKUP(CO14,$C$9:$AV$61,10))","v":1},null,null,{"$f":"VLOOKUP(CO14,$C$9:$AV$61,11)","v":"m²/m²"},null,null,{"$f":"VLOOKUP(CO14,$C$9:$AV$61,14)","v":5.0999999999999999E-7},null,null,"kg SB-eq",null,null,{"$f":"VLOOKUP(CO14,$C$9:$AV$61,16)","v":0.35},null,null,"MJ",null,null,{"$f":"VLOOKUP(CO14,$C$9:$AV$61,18)","v":1.2E-2},null,null,"kg SO2-eq",null,null,{"$f":"VLOOKUP(CO14,$C$9:$AV$61,20)","v":1.1000000000000001E-3},null,null,"kg (PO4)3-eq",null,null,{"$f":"VLOOKUP(CO14,$C$9:$AV$61,22)","v":9.3999999999999997E-4},null,null,"kg C2H4-eq",null,null,{"$f":"VLOOKUP(CO14,$C$9:$AV$61,24)","v":2.5},null,null,"kg CO2-eq",null,null,{"$f":"VLOOKUP(CO14,$C$9:$AV$61,26)","v":6.1000000000000004E-8},null,null,"kg CFC11-eq",null,null,null,null,null,"LAYER 2",null,"OSB (12 mm) [Kronospan]",null,null,7.32,null,null,"€/m²",null,null,{"$f":"IF(VLOOKUP(CO15,$C$9:$AV$61,36)=7,1,VLOOKUP(CO15,$C$9:$AV$61,10))","v":1},null,null,"m²/m²",null,null,"---",null,null,{"$f":"VLOOKUP(CX15,$C$9:$AV$61,12)","v":"---"},null,null,"---",null,null,"---",null,null,"---",null,null,7.32,null,null,{"$f":"IF(CX15=1,0,JQ12*JW12)","v":0},null,null,null,"Unit",null,{"$f":"SUM(KC11:KE20)+SUM(KF11:KH20)","v":43.867089851851858},null,null,null,null,null,"MODULE 4",null,{"$f":"BW54","v":0.5}]
[null,null,5,{"$f":"Mat_DB!D16","v":"Gypsum Board (15 mm) [Gyptec]"},{"$f":"Mat_DB!H16","v":"Sheathing Panel"},{"$f":"Mat_DB!J16","v":15},{"$f":"Mat_DB!L16","v":"λ [W/(m·K)]"},{"$f":"Mat_DB!K16","v":0.185},0.185,"---",{"$f":"Mat_DB!M16","v":"Gyptec"},{"$f":"IF(Mat_DB!O16=\"\",\"---\",Mat_DB!O16)","v":1},{"$f":"IF(Mat_DB!P16=\"\",\"---\",Mat_DB!P16)","v":"m²/m²"},{"$f":"IF(Mat_DB!Q16=\"\",\"---\",Mat_DB!Q16)","v":3.9},"€/m²",{"$f":"Mat_DB!T16","v":6.1199999999999992E-7},"kg SB-eq/m²",{"$f":"Mat_DB!U16","v":0.42},"MJ/m²",{"$f":"Mat_DB!V16","v":1.44E-2},"kg SO2-eq/m²",{"$f":"Mat_DB!W16","v":1.32E-3},"kg (PO4)3-eq/m²",{"$f":"Mat_DB!X16","v":1.1279999999999999E-3},"kg C2H4-eq/m²",{"$f":"Mat_DB!Y16","v":3},"kg CO2-eq/m²",{"$f":"Mat_DB!Z16","v":7.3200000000000007E-8},"kg CFC11-eq/m²",{"$f":"Mat_DB!AC16","v":"---"},"mm",{"$f":"Mat_DB!AD16","v":"---"},"mm",{"$f":"Mat_DB!AE16","v":"---"},"mm",1,2,5,2,null,"Unit consumption of steel",null,null,null,"Unit consumption of steel",null,null,null,null,null,null,null,null,null,"Águeda",9,null,"---",0,"---","---","---","---","---",null,5,{"$f":"Loc_DB!G16","v":"Oslo_NO"},{"$f":"Loc_DB!J16","v":6334},{"$f":"Loc_DB!N16","v":0},null,null,null,"COUNTRY",null,{"$f":"SA_Inp1!C16","v":"1 - Portugal"},null,{"$f":"IF(BW13=DE67,1,2)","v":1},null,"COP",null,{"$f":"SA_Inp1!P20","v":3.5},null,null,null,"Portugal",null,{"$f":"IF(BY13=1,\"1 - Portugal [ENABLED]\", \"1 - Portugal [DISABLED]\")","v":"1 - Portugal [ENABLED]"},null,"LAYERS",null,"Material 1",null,null,"Lambda",null,null,"R",null,null,"Material 2",null,null,"Lambda",null,null,"R",null,null,"e",null,null,null,null,null,"ST",null,{"$f":"VLOOKUP($CE$20,$C$9:$AV$61,32)*0.001","v":1.5E-3},{"$error":"#REF!"},{"$error":"#REF!"},null,"F_FL_W-",null,{"$f":"1-DS12","v":0.53260869565217384},null,null,null,"CM",null,{"$f":"EH49","v":1.8870221520720987},null,null,null,null,null,null,null,null,null,null,null,null,null,null,null,null,null,null,null,null,null,null,null,null,null,null,null,null,null,null,null,null,null,null,null,null,null,null,null,null,null,null,null,null,null,null,null,null,null,null,null,null,null,null,"C1",null,{"$f":"VLOOKUP($GD$10,$BG$12:$BS$42,2)*0.001","v":6.7000000000000004E-2},null,null,{"$f":"VLOOKUP($GG$10,$BG$12:$BS$42,2)*0.001","v":6.7000000000000004E-2},null,null,null,null,null,null,null,null,null,null,null,"LAYER 2",null,"OSB (12 mm) [Kronospan]",null,null,{"$f":"IF(VLOOKUP(CO15,$C$9:$AV$61,36)=7,1,VLOOKUP(CO15,$C$9:$AV$61,10))","v":1},null,null,"m²/m²",null,null,9.9000000000000005E-7,null,null,"kg SB-eq",null,null,51.36,null,null,"MJ",null,null,1.1028000000000001E-2,null,null,"kg SO2-eq",null,null,2.6280000000000001E-3,null,null,"kg (PO4)3-eq",null,null,6.2640000000000005E-3,null,null,"kg C2H4-eq",null,null,-9.0359999999999996,null,null,"kg CO2-eq",null,null,1.1315999999999999E-12,null,null,"kg CFC11-eq",null,null,null,null,null,"LAYER 3",null,"Mineral wool (90 mm) [Volcalis]",null,null,2.9160000000000004,null,null,"€/m²",null,null,{"$f":"IF(VLOOKUP(CO16,$C$9:$AV$61,36)=7,1,VLOOKUP(CO16,$C$9:$AV$61,10))","v":1},null,null,"m²/m²",null,null,"Steel C90/U93 (90 mm) [Pertecno]",null,null,6.2348200000000009,null,null,"€/m",null,null,{"$f":"IF(VLOOKUP(CX16,$C$9:$AV$61,36)=1,$AP$17,IF(VLOOKUP(CX16,$C$9:$AV$61,36)=6,$AP$17,VLOOKUP(CX16,$C$9:$AV$61,10)))","v":3.3074074074074078},null,null,"m/m²",null,null,2.9160000000000004,null,null,{"$f":"IF(CX16=1,0,JQ13*JW13)","v":20.621089851851856},null,null,null,"Total",null,{"$f":"KL12*GD36","v":10517.573462880004}]
[null,null,6,{"$f":"Mat_DB!D17","v":"Gypsum Board (18 mm) [Gyptec]"},{"$f":"Mat_DB!H17","v":"Sheathing Panel"},{"$f":"Mat_DB!J17","v":18},{"$f":"Mat_DB!L17","v":"λ [W/(m·K)]"},{"$f":"Mat_DB!K17","v":0.2},0.2,"---",{"$f":"Mat_DB!M17","v":"Gyptec"},{"$f":"IF(Mat_DB!O17=\"\",\"---\",Mat_DB!O17)","v":1},{"$f":"IF(Mat_DB!P17=\"\",\"---\",Mat_DB!P17)","v":"m²/m²"},{"$f":"IF(Mat_DB!Q17=\"\",\"---\",Mat_DB!Q17)","v":5.21},"€/m²",{"$f":"Mat_DB!T17","v":7.3439999999999991E-7},"kg SB-eq/m²",{"$f":"Mat_DB!U17","v":0.504},"MJ/m²",{"$f":"Mat_DB!V17","v":1.728E-2},"kg SO2-eq/m²",{"$f":"Mat_DB!W17","v":1.5840000000000001E-3},"kg (PO4)3-eq/m²",{"$f":"Mat_DB!X17","v":1.3535999999999999E-3},"kg C2H4-eq/m²",{"$f":"Mat_DB!Y17","v":3.5999999999999996},"kg CO2-eq/m²",{"$f":"Mat_DB!Z17","v":8.7839999999999998E-8},"kg CFC11-eq/m²",{"$f":"Mat_DB!AC17","v":"---"},"mm",{"$f":"Mat_DB!AD17","v":"---"},"mm",{"$f":"Mat_DB!AE17","v":"---"},"mm",1,2,5,2,null,null,null,null,null,null,null,null,null,null,null,null,null,null,null,"Aguiar da Beira",15,null,"Minho-Lima",1,268,1629,1500,20.5,-4,null,6,{"$f":"Loc_DB!G17","v":"Stockholm_SE"},{"$f":"Loc_DB!J17","v":4351},{"$f":"Loc_DB!N17","v":3},null,null,null,"PORTUGAL",null,{"$f":"SA_Inp1!H16","v":"Coimbra"},null,null,null,"EER",null,{"$f":"SA_Inp1!P21","v":3.5},null,null,null,"Other Locations",null,{"$f":"IF(BY13=2,\"2 - Other Locations [ENABLED]\", \"2 - Other Locations [DISABLED]\")","v":"2 - Other Locations [DISABLED]"},null,"LAYER 1",null,{"$f":"SA_Inp2!D17","v":"Gypsum Board (12,5 mm) [Gyptec]"},null,{"$f":"IF(CM14=$D$9,1,IF(CM14=$D$10,2,IF(CM14=$D$11,3,IF(CM14=$D$12,4,IF(CM14=$D$13,5,IF(CM14=$D$14,6,IF(CM14=$D$15,7,IF(CM14=$D$16,8,IF(CM14=$D$17,9,IF(CM14=$D$18,10,IF(CM14=$D$19,11,IF(CM14=$D$20,12,IF(CM14=$D$21,13,IF(CM14=$D$22,14,IF(CM14=$D$23,15,IF(CM14=$D$24,16,IF(CM14=$D$25,17,IF(CM14=$D$26,18,IF(CM14=$D$27,19,IF(CM14=$D$28,20,IF(CM14=$D$29,21,IF(CM14=$D$30,22,IF(CM14=$D$31,23,IF(CM14=$D$32,24,IF(CM14=$D$33,25,IF(CM14=$D$34,26,IF(CM14=$D$35,27,IF(CM14=$D$36,28,IF(CM14=$D$37,29,IF(CM14=$D$38,30,IF(CM14=$D$39,31,IF(CM14=$D$40,32,IF(CM14=$D$41,33,IF(CM14=$D$42,34,IF(CM14=$D$43,35,IF(CM14=$D$44,36,IF(CM14=$D$45,37,IF(CM14=$D$46,38,IF(CM14=$D$47,39,IF(CM14=$D$48,40,IF(CM14=$D$49,41,IF(CM14=$D$50,42,IF(CM14=$D$51,43,IF(CM14=$D$52,44,IF(CM14=$D$53,45,IF(CM14=$D$54,46,IF(CM14=$D$55,47,IF(CM14=$D$56,48,IF(CM14=$D$57,49,IF(CM14=$D$58,50,0))))))))))))))))))))))))))))))))))))))))))))))))))","v":4},{"$f":"DN32","v":0.17499999999999999},null,null,{"$f":"DR32","v":7.1428571428571438E-2},null,null,{"$f":"SA_Inp2!I17","v":"---"},null,{"$f":"IF(CV14=$D$9,1,IF(CV14=$D$10,2,IF(CV14=$D$11,3,IF(CV14=$D$12,4,IF(CV14=$D$13,5,IF(CV14=$D$14,6,IF(CV14=$D$15,7,IF(CV14=$D$16,8,IF(CV14=$D$17,9,IF(CV14=$D$18,10,IF(CV14=$D$19,11,IF(CV14=$D$20,12,IF(CV14=$D$21,13,IF(CV14=$D$22,14,IF(CV14=$D$23,15,IF(CV14=$D$24,16,IF(CV14=$D$25,17,IF(CV14=$D$26,18,IF(CV14=$D$27,19,IF(CV14=$D$28,20,IF(CV14=$D$29,21,IF(CV14=$D$30,22,IF(CV14=$D$31,23,IF(CV14=$D$32,24,IF(CV14=$D$33,25,IF(CV14=$D$34,26,IF(CV14=$D$35,27,IF(CV14=$D$36,28,IF(CV14=$D$37,29,IF(CV14=$D$38,30,IF(CV14=$D$39,31,IF(CV14=$D$40,32,IF(CV14=$D$41,33,IF(CV14=$D$42,34,IF(CV14=$D$43,35,IF(CV14=$D$44,36,IF(CV14=$D$45,37,IF(CV14=$D$46,38,IF(CV14=$D$47,39,IF(CV14=$D$48,40,IF(CV14=$D$49,41,IF(CV14=$D$50,42,IF(CV14=$D$51,43,IF(CV14=$D$52,44,IF(CV14=$D$53,45,IF(CV14=$D$54,46,IF(CV14=$D$55,47,IF(CV14=$D$56,48,IF(CV14=$D$57,49,IF(CV14=$D$58,50,0))))))))))))))))))))))))))))))))))))))))))))))))))","v":1},{"$f":"DP32","v":"---"},null,null,{"$f":"DS32","v":"---"},null,null,{"$f":"DM32","v":12.5},null,null,null,null,null,"SS",null,{"$f":"CC19*0.001","v":0.4},{"$error":"#REF!"},{"$error":"#REF!"},null,"F_ST_W",null,{"$f":"DM13/DM17","v":1.6304347826086956E-2},null,null,null,"GM1",null,{"$f":"EP49","v":1.525061247172562},null,null,null,null,null,null,null,null,null,null,null,null,null,null,null,null,null,null,null,null,null,null,null,null,null,null,null,null,null,null,null,null,null,null,null,null,null,null,null,null,null,null,null,null,null,null,null,null,null,null,null,null,null,null,"C2",null,{"$f":"VLOOKUP($GD$10,$BG$12:$BS$42,3)","v":1304},null,null,{"$f":"VLOOKUP($GG$10,$BG$12:$BS$42,3)","v":1304},null,null,null,null,null,null,null,null,null,null,null,"LAYER 3",null,"Mineral wool (90 mm) [Volcalis]",null,null,{"$f":"IF(VLOOKUP(CO16,$C$9:$AV$61,36)=7,1,VLOOKUP(CO16,$C$9:$AV$61,10))","v":1},null,null,"m²/m²",null,null,1.008E-4,null,null,"kg SB-eq",null,null,31.14,null,null,"MJ",null,null,9.0899999999999991E-3,null,null,"kg SO2-eq",null,null,1.872E-3,null,null,"kg (PO4)3-eq",null,null,6.4619999999999999E-4,null,null,"kg C2H4-eq",null,null,1.5209999999999999,null,null,"kg CO2-eq",null,null,1.5929999999999997E-11,null,null,"kg CFC11-eq",null,null,null,null,null,"LAYER 4",null,"OSB (12 mm) [Kronospan]",null,null,7.32,null,null,"€/m²",null,null,1,null,null,"m²/m²",null,null,"---",null,null,"---",null,null,"---",null,null,{"$f":"IF(VLOOKUP(CX17,$C$9:$AV$61,36)=1,$AP$17,IF(VLOOKUP(CX17,$C$9:$AV$61,36)=6,$AP$17,VLOOKUP(CX17,$C$9:$AV$61,10)))","v":"---"},null,null,"---",null,null,7.32,null,null,0]
[null,null,7,{"$f":"Mat_DB!D18","v":"OSB (9 mm) [Kronospan]"},{"$f":"Mat_DB!H18","v":"Sheathing Panel"},{"$f":"Mat_DB!J18","v":9},{"$f":"Mat_DB!L18","v":"λ [W/(m·K)]"},{"$f":"Mat_DB!K18","v":0.13},0.13,"---",{"$f":"Mat_DB!M18","v":"Kronospan"},{"$f":"IF(Mat_DB!O18=\"\",\"---\",Mat_DB!O18)","v":1},{"$f":"IF(Mat_DB!P18=\"\",\"---\",Mat_DB!P18)","v":"m²/m²"},{"$f":"IF(Mat_DB!Q18=\"\",\"---\",Mat_DB!Q18)","v":5.49},"€/m²",{"$f":"Mat_DB!T18","v":7.4250000000000009E-7},"kg SB-eq/m²",{"$f":"Mat_DB!U18","v":38.519999999999996},"MJ/m²",{"$f":"Mat_DB!V18","v":8.2710000000000006E-3},"kg SO2-eq/m²",{"$f":"Mat_DB!W18","v":1.9710000000000001E-3},"kg (PO4)3-eq/m²",{"$f":"Mat_DB!X18","v":4.6980000000000008E-3},"kg C2H4-eq/m²",{"$f":"Mat_DB!Y18","v":-6.7769999999999992},"kg CO2-eq/m²",{"$f":"Mat_DB!Z18","v":8.4870000000000001E-13},"kg CFC11-eq/m²",{"$f":"Mat_DB!AC18","v":"---"},"mm",{"$f":"Mat_DB!AD18","v":"---"},"mm",{"$f":"Mat_DB!AE18","v":"---"},"mm",1,2,5,2,null,"Tracks",{"$f":"(1/(BW26)*2)","v":0.7407407407407407},"m/m²",null,"Tracks",{"$f":"(1/BW46)*2","v":0.7407407407407407},"m/m²",null,null,null,null,null,null,null,"Alandroal",25,null,"Alto Trás-os-Montes",{"$f":"BG14+1","v":2},680,2015,1400,21.5,-7,null,7,{"$f":"Loc_DB!G18","v":"Berlin_DE"},{"$f":"Loc_DB!J18","v":3211},{"$f":"Loc_DB!N18","v":28},null,null,null,"ALTITUDE",null,{"$f":"SA_Inp1!H17","v":75},null,null,null,"ELECT. COST",null,{"$f":"SA_Inp1!P26","v":0.25},null,null,null,null,null,null,null,"LAYER 2",null,{"$f":"SA_Inp2!D18","v":"OSB (12 mm) [Kronospan]"},null,8,0.13,null,null,9.2307692307692313E-2,null,null,{"$f":"SA_Inp2!I18","v":"---"},null,{"$f":"IF(CV15=$D$9,1,IF(CV15=$D$10,2,IF(CV15=$D$11,3,IF(CV15=$D$12,4,IF(CV15=$D$13,5,IF(CV15=$D$14,6,IF(CV15=$D$15,7,IF(CV15=$D$16,8,IF(CV15=$D$17,9,IF(CV15=$D$18,10,IF(CV15=$D$19,11,IF(CV15=$D$20,12,IF(CV15=$D$21,13,IF(CV15=$D$22,14,IF(CV15=$D$23,15,IF(CV15=$D$24,16,IF(CV15=$D$25,17,IF(CV15=$D$26,18,IF(CV15=$D$27,19,IF(CV15=$D$28,20,IF(CV15=$D$29,21,IF(CV15=$D$30,22,IF(CV15=$D$31,23,IF(CV15=$D$32,24,IF(CV15=$D$33,25,IF(CV15=$D$34,26,IF(CV15=$D$35,27,IF(CV15=$D$36,28,IF(CV15=$D$37,29,IF(CV15=$D$38,30,IF(CV15=$D$39,31,IF(CV15=$D$40,32,IF(CV15=$D$41,33,IF(CV15=$D$42,34,IF(CV15=$D$43,35,IF(CV15=$D$44,36,IF(CV15=$D$45,37,IF(CV15=$D$46,38,IF(CV15=$D$47,39,IF(CV15=$D$48,40,IF(CV15=$D$49,41,IF(CV15=$D$50,42,IF(CV15=$D$51,43,IF(CV15=$D$52,44,IF(CV15=$D$53,45,IF(CV15=$D$54,46,IF(CV15=$D$55,47,IF(CV15=$D$56,48,IF(CV15=$D$57,49,IF(CV15=$D$58,50,0))))))))))))))))))))))))))))))))))))))))))))))))))","v":1},"---",null,null,"---",null,null,12,null,null,null,null,null,"FL",null,{"$f":"VLOOKUP($CE$20,$C$9:$AV$61,28)*0.001","v":4.3000000000000003E-2},{"$error":"#REF!"},{"$error":"#REF!"},null,"F_ST_W-",null,{"$f":"1-DS14","v":0.98369565217391308},null,null,null,"GM2",null,{"$f":"EX49","v":1.3616773963823072},null,null,null,null,null,null,null,null,null,null,null,null,null,null,null,null,null,null,null,null,null,null,null,null,null,null,null,null,null,null,null,null,null,null,null,null,null,null,null,null,null,null,null,null,null,null,null,null,null,null,null,null,null,null,"C3",null,{"$f":"VLOOKUP($GD$10,$BG$12:$BS$42,4)","v":1000},null,null,{"$f":"VLOOKUP($GG$10,$BG$12:$BS$42,4)","v":1000},null,null,null,null,null,null,null,null,null,null,null,"LAYER 4",null,"OSB (12 mm) [Kronospan]",null,null,1,null,null,"m²/m²",null,null,9.9000000000000005E-7,null,null,"kg SB-eq",null,null,51.36,null,null,"MJ",null,null,1.1028000000000001E-2,null,null,"kg SO2-eq",null,null,2.6280000000000001E-3,null,null,"kg (PO4)3-eq",null,null,6.2640000000000005E-3,null,null,"kg C2H4-eq",null,null,-9.0359999999999996,null,null,"kg CO2-eq",null,null,1.1315999999999999E-12,null,null,"kg CFC11-eq",null,null,null,null,null,"LAYER 5",null,"Mortar (10 mm)",null,null,2.44,null,null,"€/m²",null,null,1,null,null,"m²/m²",null,null,"---",null,null,"---",null,null,"---",null,null,"---",null,null,"---",null,null,2.44,null,null,0,null,null,null,null,null,null,null,null,null,null,null,"WEIGHTS (LCA)"]
[null,null,8,{"$f":"Mat_DB!D19","v":"OSB (12 mm) [Kronospan]"},{"$f":"Mat_DB!H19","v":"Sheathing Panel"},{"$f":"Mat_DB!J19","v":12},{"$f":"Mat_DB!L19","v":"λ [W/(m·K)]"},{"$f":"Mat_DB!K19","v":0.13},0.13,"---",{"$f":"Mat_DB!M19","v":"Kronospan"},{"$f":"IF(Mat_DB!O19=\"\",\"---\",Mat_DB!O19)","v":1},{"$f":"IF(Mat_DB!P19=\"\",\"---\",Mat_DB!P19)","v":"m²/m²"},{"$f":"IF(Mat_DB!Q19=\"\",\"---\",Mat_DB!Q19)","v":7.32},"€/m²",{"$f":"Mat_DB!T19","v":9.9000000000000005E-7},"kg SB-eq/m²",{"$f":"Mat_DB!U19","v":51.36},"MJ/m²",{"$f":"Mat_DB!V19","v":1.1028000000000001E-2},"kg SO2-eq/m²",{"$f":"Mat_DB!W19","v":2.6280000000000001E-3},"kg (PO4)3-eq/m²",{"$f":"Mat_DB!X19","v":6.2640000000000005E-3},"kg C2H4-eq/m²",{"$f":"Mat_DB!Y19","v":-9.0359999999999996},"kg CO2-eq/m²",{"$f":"Mat_DB!Z19","v":1.1315999999999999E-12},"kg CFC11-eq/m²",{"$f":"Mat_DB!AC19","v":"---"},"mm",{"$f":"Mat_DB!AD19","v":"---"},"mm",{"$f":"Mat_DB!AE19","v":"---"},"mm",1,2,5,2,null,"Studs",{"$f":"(((BW17/(CC19*0.001))+1)*BW26)/(BW17*BW26)","v":2.5666666666666669},"m/m²",null,"Studs",{"$f":"(((BW37/(CC39*0.001))+1)*BW46)/(BW37*BW46)","v":2.5666666666666669},"m/m²",null,null,null,null,null,null,null,"Albergaria-a-Velha",9,null,"Cávado",3,171,1491,1300,20.7,-3,null,8,{"$f":"Loc_DB!G19","v":"Brussels_BE"},{"$f":"Loc_DB!J19","v":2974},{"$f":"Loc_DB!N19","v":16},null,null,null,"OTHER",null,{"$f":"SA_Inp1!P16","v":"Helsinki_FI"},null,{"$f":"IF(BW16=$BO$9,1,IF(BW16=$BO$10,2,IF(BW16=$BO$11,3,IF(BW16=$BO$12,4,IF(BW16=$BO$13,5,IF(BW16=$BO$14,6,IF(BW16=$BO$15,7,IF(BW16=$BO$16,8,IF(BW16=$BO$17,9,IF(BW16=$BO$18,10,IF(BW16=$BO$19,11,IF(BW16=$BO$20,12,IF(BW16=$BO$21,13,IF(BW16=$BO$22,14,IF(BW16=$BO$23,15,IF(BW16=$BO$24,16,IF(BW16=$BO$25,17,IF(BW16=$BO$26,18,IF(BW16=$BO$27,19,IF(BW16=$BO$28,20,IF(BW16=$BO$29,21,IF(BW16=$BO$30,22,IF(BW16=$BO$31,23,IF(BW16=$BO$32,24,IF(BW16=$BO$33,25,IF(BW16=$BO$34,26,IF(BW16=$BO$35,27,IF(BW16=$BO$36,28,IF(BW16=$BO$37,29,IF(BW16=$BO$38,30,0))))))))))))))))))))))))))))))","v":3},null,null,null,null,null,null,null,null,null,null,null,"LAYER 3",null,{"$f":"SA_Inp2!D19","v":"Mineral wool (90 mm) [Volcalis]"},null,15,3.5000000000000003E-2,null,null,2.5714285714285712,null,null,{"$f":"SA_Inp2!I19","v":"Steel C90/U93 (90 mm) [Pertecno]"},null,{"$f":"IF(CV16=$D$9,1,IF(CV16=$D$10,2,IF(CV16=$D$11,3,IF(CV16=$D$12,4,IF(CV16=$D$13,5,IF(CV16=$D$14,6,IF(CV16=$D$15,7,IF(CV16=$D$16,8,IF(CV16=$D$17,9,IF(CV16=$D$18,10,IF(CV16=$D$19,11,IF(CV16=$D$20,12,IF(CV16=$D$21,13,IF(CV16=$D$22,14,IF(CV16=$D$23,15,IF(CV16=$D$24,16,IF(CV16=$D$25,17,IF(CV16=$D$26,18,IF(CV16=$D$27,19,IF(CV16=$D$28,20,IF(CV16=$D$29,21,IF(CV16=$D$30,22,IF(CV16=$D$31,23,IF(CV16=$D$32,24,IF(CV16=$D$33,25,IF(CV16=$D$34,26,IF(CV16=$D$35,27,IF(CV16=$D$36,28,IF(CV16=$D$37,29,IF(CV16=$D$38,30,IF(CV16=$D$39,31,IF(CV16=$D$40,32,IF(CV16=$D$41,33,IF(CV16=$D$42,34,IF(CV16=$D$43,35,IF(CV16=$D$44,36,IF(CV16=$D$45,37,IF(CV16=$D$46,38,IF(CV16=$D$47,39,IF(CV16=$D$48,40,IF(CV16=$D$49,41,IF(CV16=$D$50,42,IF(CV16=$D$51,43,IF(CV16=$D$52,44,IF(CV16=$D$53,45,IF(CV16=$D$54,46,IF(CV16=$D$55,47,IF(CV16=$D$56,48,IF(CV16=$D$57,49,IF(CV16=$D$58,50,0))))))))))))))))))))))))))))))))))))))))))))))))))","v":25},50,null,null,1.8E-3,null,null,90,null,null,null,null,null,"SHT",null,{"$f":"CC21*0.001","v":2.4500000000000001E-2},null,null,null,"F_WZ_SS",null,{"$f":"DM17/DM14","v":0.22999999999999998},null,null,null,"GM3",null,{"$f":"FF49","v":1.3075685183169883},null,null,null,null,null,null,null,null,null,null,null,null,null,null,null,null,null,null,null,null,null,null,null,null,null,null,null,null,null,null,null,null,null,null,null,null,null,null,null,null,null,null,null,null,null,null,null,null,null,null,null,null,null,null,"C4",null,{"$f":"VLOOKUP($GD$10,$BG$12:$BS$42,5)","v":20.9},null,null,{"$f":"VLOOKUP($GG$10,$BG$12:$BS$42,5)","v":20.9},null,null,null,null,null,null,null,null,null,null,null,"LAYER 5",null,"Mortar (10 mm)",null,null,1,null,null,"m²/m²",null,null,3.1700000000000001E-6,null,null,"kg SB-eq",null,null,9.0500000000000007,null,null,"MJ",null,null,4.8799999999999998E-3,null,null,"kg SO2-eq",null,null,9.9799999999999997E-4,null,null,"kg (PO4)3-eq",null,null,2.4499999999999999E-4,null,null,"kg C2H4-eq",null,null,1.42,null,null,"kg CO2-eq",null,null,9.6600000000000005E-8,null,null,"kg CFC11-eq",null,null,null,null,null,"LAYER 6",null,"---",null,null,"---",null,null,"---",null,null,"---",null,null,"---",null,null,"---",null,null,"---",null,null,"---",null,null,"---",null,null,"---",null,null,0,null,null,0]
[null,null,9,{"$f":"Mat_DB!D20","v":"OSB (15 mm) [Kronospan]"},{"$f":"Mat_DB!H20","v":"Sheathing Panel"},{"$f":"Mat_DB!J20","v":15},{"$f":"Mat_DB!L20","v":"λ [W/(m·K)]"},{"$f":"Mat_DB!K20","v":0.13},0.13,"---",{"$f":"Mat_DB!M20","v":"Kronospan"},{"$f":"IF(Mat_DB!O20=\"\",\"---\",Mat_DB!O20)","v":1},{"$f":"IF(Mat_DB!P20=\"\",\"---\",Mat_DB!P20)","v":"m²/m²"},{"$f":"IF(Mat_DB!Q20=\"\",\"---\",Mat_DB!Q20)","v":9.07},"€/m²",{"$f":"Mat_DB!T20","v":1.2375E-6},"kg SB-eq/m²",{"$f":"Mat_DB!U20","v":64.2},"MJ/m²",{"$f":"Mat_DB!V20","v":1.3785000000000002E-2},"kg SO2-eq/m²",{"$f":"Mat_DB!W20","v":3.2850000000000002E-3},"kg (PO4)3-eq/m²",{"$f":"Mat_DB!X20","v":7.8300000000000002E-3},"kg C2H4-eq/m²",{"$f":"Mat_DB!Y20","v":-11.295},"kg CO2-eq/m²",{"$f":"Mat_DB!Z20","v":1.4144999999999999E-12},"kg CFC11-eq/m²",{"$f":"Mat_DB!AC20","v":"---"},"mm",{"$f":"Mat_DB!AD20","v":"---"},"mm",{"$f":"Mat_DB!AE20","v":"---"},"mm",1,2,5,2,null,"Total",{"$f":"SUM(AP15:AP16)","v":3.3074074074074078},"m/m²",null,"Total",{"$f":"SUM(AT15:AT16)","v":3.3074074074074078},"m/m²",null,null,null,null,null,null,null,"Albufeira",28,null,"Ave",4,426,1653,1500,20.8,-3,null,9,{"$f":"Loc_DB!G20","v":"Vienna_AT"},{"$f":"Loc_DB!J20","v":3258},{"$f":"Loc_DB!N20","v":35},null,null,null,"MF",null,{"$f":"SA_Inp1!G20","v":15},null,null,null,"Wall Configuration 2",null,null,null,null,null,null,null,null,null,"LAYER 4",null,{"$f":"SA_Inp2!D20","v":"OSB (12 mm) [Kronospan]"},null,8,0.13,null,null,9.2307692307692313E-2,null,null,{"$f":"SA_Inp2!I20","v":"---"},null,1,"---",null,null,"---",null,null,12,null,null,null,null,null,"WZ",null,{"$f":"DM15+2*DM16","v":9.1999999999999998E-2},null,null,null,"F_WZ_SS-",null,{"$f":"1-DS16","v":0.77},null,null,null,"AZM",null,{"$f":"FN49","v":1.455561576800291},null,null,null,null,null,null,null,null,null,null,null,null,null,null,null,null,null,null,null,null,null,null,null,null,null,null,null,null,null,null,null,null,null,null,null,null,null,null,null,null,null,null,null,null,null,null,null,null,null,null,null,null,null,null,"C5",null,{"$f":"VLOOKUP($GD$10,$BG$12:$BS$42,6)","v":0},null,null,{"$f":"VLOOKUP($GG$10,$BG$12:$BS$42,6)","v":0},null,null,null,null,null,null,null,null,null,null,null,"LAYER 6",null,"---",null,null,"---",null,null,"---",null,null,"---",null,null,"kg SB-eq",null,null,"---",null,null,"MJ",null,null,"---",null,null,"kg SO2-eq",null,null,"---",null,null,"kg (PO4)3-eq",null,null,"---",null,null,"kg C2H4-eq",null,null,"---",null,null,"kg CO2-eq",null,null,"---",null,null,"kg CFC11-eq",null,null,null,null,null,"LAYER 7",null,"---",null,null,"---",null,null,"---",null,null,"---",null,null,"---",null,null,"---",null,null,"---",null,null,"---",null,null,"---",null,null,"---",null,null,0,null,null,0,null,null,null,null,null,null,null,null,null,null,null,"ADPE",null,{"$f":"BW56","v":0.14000000000000001}]
[null,null,10,{"$f":"Mat_DB!D21","v":"OSB (18 mm) [Kronospan]"},{"$f":"Mat_DB!H21","v":"Sheathing Panel"},{"$f":"Mat_DB!J21","v":18},{"$f":"Mat_DB!L21","v":"λ [W/(m·K)]"},{"$f":"Mat_DB!K21","v":0.13},0.13,"---",{"$f":"Mat_DB!M21","v":"Kronospan"},{"$f":"IF(Mat_DB!O21=\"\",\"---\",Mat_DB!O21)","v":1},{"$f":"IF(Mat_DB!P21=\"\",\"---\",Mat_DB!P21)","v":"m²/m²"},{"$f":"IF(Mat_DB!Q21=\"\",\"---\",Mat_DB!Q21)","v":10.93},"€/m²",{"$f":"Mat_DB!T21","v":1.4850000000000002E-6},"kg SB-eq/m²",{"$f":"Mat_DB!U21","v":77.039999999999992},"MJ/m²",{"$f":"Mat_DB!V21","v":1.6542000000000001E-2},"kg SO2-eq/m²",{"$f":"Mat_DB!W21","v":3.9420000000000002E-3},"kg (PO4)3-eq/m²",{"$f":"Mat_DB!X21","v":9.3960000000000016E-3},"kg C2H4-eq/m²",{"$f":"Mat_DB!Y21","v":-13.553999999999998},"kg CO2-eq/m²",{"$f":"Mat_DB!Z21","v":1.6974E-12},"kg CFC11-eq/m²",{"$f":"Mat_DB!AC21","v":"---"},"mm",{"$f":"Mat_DB!AD21","v":"---"},"mm",{"$f":"Mat_DB!AE21","v":"---"},"mm",1,2,5,2,null,null,null,null,null,null,null,null,null,null,null,null,null,null,null,"Alcácer do Sal",26,null,"Grande Porto",5,94,1250,1600,20.9,0,null,10,{"$f":"Loc_DB!G21","v":"London_GB"},{"$f":"Loc_DB!J21","v":3008},{"$f":"Loc_DB!N21","v":6},null,null,null,"BF",null,{"$f":"SA_Inp1!G21","v":15},null,null,null,null,null,null,null,null,null,null,null,null,null,"LAYER 5",null,{"$f":"SA_Inp2!D21","v":"Mortar (10 mm)"},null,41,1.8,null,null,5.5555555555555558E-3,null,null,{"$f":"SA_Inp2!I21","v":"---"},null,1,"---",null,null,"---",null,null,10,null,null,null,null,null,"TBW",null,{"$f":"CC22*0.001","v":0},null,null,null,"F_TBW_WZ",null,{"$f":"DM18/DM17","v":0},null,null,null,"R",null,{"$f":"IF(DY12=1,DY13,IF(DY12=2,DY14,IF(DY12=3,DY15,IF(DY12=4,DY16,IF(DY12=5,DY17)))))","v":1.8870221520720987},null,null,null,null,null,null,null,null,null,null,null,null,null,null,null,null,null,null,null,null,null,null,null,null,null,null,null,null,null,null,null,null,null,null,null,null,null,null,null,null,null,null,null,null,null,null,null,null,null,null,null,null,null,null,"DD",null,{"$f":"GD14+GD15*(GD12-GD13)","v":1312},null,null,{"$f":"GG14+GG15*(GG12-GG13)","v":1312},null,null,null,null,null,null,null,null,null,null,null,"LAYER 7",null,"---",null,null,"---",null,null,"---",null,null,"---",null,null,"kg SB-eq",null,null,"---",null,null,"MJ",null,null,"---",null,null,"kg SO2-eq",null,null,"---",null,null,"kg (PO4)3-eq",null,null,"---",null,null,"kg C2H4-eq",null,null,"---",null,null,"kg CO2-eq",null,null,"---",null,null,"kg CFC11-eq",null,null,null,null,null,"LAYER 8",null,"---",null,null,"---",null,null,"---",null,null,"---",null,null,"---",null,null,"---",null,null,"---",null,null,"---",null,null,"---",null,null,"---",null,null,0,null,null,0,null,null,null,null,null,null,null,null,null,null,null,"ADPF",null,0.14000000000000001]
[null,null,11,{"$f":"Mat_DB!D22","v":"OSB (22 mm) [Kronospan]"},{"$f":"Mat_DB!H22","v":"Sheathing Panel"},{"$f":"Mat_DB!J22","v":22},{"$f":"Mat_DB!L22","v":"λ [W/(m·K)]"},{"$f":"Mat_DB!K22","v":0.13},0.13,"---",{"$f":"Mat_DB!M22","v":"Kronospan"},{"$f":"IF(Mat_DB!O22=\"\",\"---\",Mat_DB!O22)","v":1},{"$f":"IF(Mat_DB!P22=\"\",\"---\",Mat_DB!P22)","v":"m²/m²"},{"$f":"IF(Mat_DB!Q22=\"\",\"---\",Mat_DB!Q22)","v":13.43},"€/m²",{"$f":"Mat_DB!T22","v":1.815E-6},"kg SB-eq/m²",{"$f":"Mat_DB!U22","v":94.16},"MJ/m²",{"$f":"Mat_DB!V22","v":2.0218000000000003E-2},"kg SO2-eq/m²",{"$f":"Mat_DB!W22","v":4.8180000000000002E-3},"kg (PO4)3-eq/m²",{"$f":"Mat_DB!X22","v":1.1484000000000001E-2},"kg C2H4-eq/m²",{"$f":"Mat_DB!Y22","v":-16.565999999999999},"kg CO2-eq/m²",{"$f":"Mat_DB!Z22","v":2.0745999999999997E-12},"kg CFC11-eq/m²",{"$f":"Mat_DB!AC22","v":"---"},"mm",{"$f":"Mat_DB!AD22","v":"---"},"mm",{"$f":"Mat_DB!AE22","v":"---"},"mm",1,2,5,2,null,"AIR CAVITIES - A",null,null,null,null,null,null,null,null,null,null,null,null,null,"Alcanena",20,null,"Tâmega",6,320,1570,1600,21.4,-3,null,11,{"$f":"Loc_DB!G22","v":"Prague_CZ"},{"$f":"Loc_DB!J22","v":3809},{"$f":"Loc_DB!N22","v":15},null,null,null,"LF",null,{"$f":"SA_Inp1!G22","v":10},null,null,null,"SS",null,{"$f":"SA_Inp2!R15","v":400},null,null,null,null,null,null,null,"LAYER 6",null,{"$f":"SA_Inp2!D22","v":"---"},null,1,"---",null,null,"---",null,null,{"$f":"SA_Inp2!I22","v":"---"},null,1,"---",null,null,"---",null,null,"---",null,null,null,null,null,null,null,null,null,null,null,"F_TBW_WZ-",null,{"$f":"1-DS18","v":1},null,null,null,"U",null,{"$f":"1/DY18","v":0.52993548533700119},null,null,null,null,null,null,null,null,null,null,null,null,null,null,null,null,null,null,null,null,null,null,null,null,null,null,null,null,null,null,null,null,null,null,null,null,null,null,null,null,null,null,null,null,null,null,null,null,null,null,null,null,null,null,"CAET",null,{"$f":"GD16+GD17*(GD12-GD13)","v":20.9},null,null,{"$f":"GG16+GG17*(GG12-GG13)","v":20.9},null,null,null,null,null,null,null,null,null,null,null,"LAYER 8",null,"---",null,null,"---",null,null,"---",null,null,"---",null,null,"kg SB-eq",null,null,"---",null,null,"MJ",null,null,"---",null,null,"kg SO2-eq",null,null,"---",null,null,"kg (PO4)3-eq",null,null,"---",null,null,"kg C2H4-eq",null,null,"---",null,null,"kg CO2-eq",null,null,"---",null,null,"kg CFC11-eq",null,null,null,null,null,"LAYER 9",null,"---",null,null,"---",null,null,"---",null,null,"---",null,null,"---",null,null,"---",null,null,"---",null,null,"---",null,null,"---",null,null,"---",null,null,0,null,null,0,null,null,null,null,null,null,null,null,null,null,null,"AP",null,0.14000000000000001]
[null,null,12,{"$f":"Mat_DB!D23","v":"OSB (25 mm) [Kronospan]"},{"$f":"Mat_DB!H23","v":"Sheathing Panel"},{"$f":"Mat_DB!J23","v":25},{"$f":"Mat_DB!L23","v":"λ [W/(m·K)]"},{"$f":"Mat_DB!K23","v":0.13},0.13,"---",{"$f":"Mat_DB!M23","v":"Kronospan"},{"$f":"IF(Mat_DB!O23=\"\",\"---\",Mat_DB!O23)","v":1},{"$f":"IF(Mat_DB!P23=\"\",\"---\",Mat_DB!P23)","v":"m²/m²"},{"$f":"IF(Mat_DB!Q23=\"\",\"---\",Mat_DB!Q23)","v":15.06},"€/m²",{"$f":"Mat_DB!T23","v":2.0625000000000002E-6},"kg SB-eq/m²",{"$f":"Mat_DB!U23","v":107},"MJ/m²",{"$f":"Mat_DB!V23","v":2.2975000000000006E-2},"kg SO2-eq/m²",{"$f":"Mat_DB!W23","v":5.4750000000000007E-3},"kg (PO4)3-eq/m²",{"$f":"Mat_DB!X23","v":1.3050000000000003E-2},"kg C2H4-eq/m²",{"$f":"Mat_DB!Y23","v":-18.824999999999999},"kg CO2-eq/m²",{"$f":"Mat_DB!Z23","v":2.3575E-12},"kg CFC11-eq/m²",{"$f":"Mat_DB!AC23","v":"---"},"mm",{"$f":"Mat_DB!AD23","v":"---"},"mm",{"$f":"Mat_DB!AE23","v":"---"},"mm",1,2,5,2,null,null,null,null,null,null,null,null,null,null,null,null,null,null,null,"Alcobaça",19,null,"Douro",7,579,1764,1400,22.7,-6,null,12,{"$f":"Loc_DB!G23","v":"Athens_GR"},{"$f":"Loc_DB!J23","v":1142},{"$f":"Loc_DB!N23","v":269},null,null,null,"RF",null,{"$f":"SA_Inp1!G23","v":10},null,null,null,"STR",null,{"$f":"IF(VLOOKUP(CX14,$C$9:$AV$61,36)=1,CV14,IF(VLOOKUP(CX15,$C$9:$AV$61,36)=1,CV15,IF(VLOOKUP(CX16,$C$9:$AV$61,36)=1,CV16,IF(VLOOKUP(CX17,$C$9:$AV$61,36)=1,CV17,IF(VLOOKUP(CX18,$C$9:$AV$61,36)=1,CV18,IF(VLOOKUP(CX19,$C$9:$AV$61,36)=1,CV19,IF(VLOOKUP(CX20,$C$9:$AV$61,36)=1,CV20,IF(VLOOKUP(CX21,$C$9:$AV$61,36)=1,CV21,IF(VLOOKUP(CX22,$C$9:$AV$61,36)=1,CV22,IF(VLOOKUP(CX23,$C$9:$AV$61,36)=1,CV23,\"---\"))))))))))","v":"Steel C90/U93 (90 mm) [Pertecno]"},null,{"$f":"IF(CC20=$D$9,1,IF(CC20=$D$10,2,IF(CC20=$D$11,3,IF(CC20=$D$12,4,IF(CC20=$D$13,5,IF(CC20=$D$14,6,IF(CC20=$D$15,7,IF(CC20=$D$16,8,IF(CC20=$D$17,9,IF(CC20=$D$18,10,IF(CC20=$D$19,11,IF(CC20=$D$20,12,IF(CC20=$D$21,13,IF(CC20=$D$22,14,IF(CC20=$D$23,15,IF(CC20=$D$24,16,IF(CC20=$D$25,17,IF(CC20=$D$26,18,IF(CC20=$D$27,19,IF(CC20=$D$28,20,IF(CC20=$D$29,21,IF(CC20=$D$30,22,IF(CC20=$D$31,23,IF(CC20=$D$32,24,IF(CC20=$D$33,25,IF(CC20=$D$34,26,IF(CC20=$D$35,27,IF(CC20=$D$36,28,IF(CC20=$D$37,29,IF(CC20=$D$38,30,IF(CC20=$D$39,31,IF(CC20=$D$40,32,IF(CC20=$D$41,33,IF(CC20=$D$42,34,IF(CC20=$D$43,35,IF(CC20=$D$44,36,IF(CC20=$D$45,37,IF(CC20=$D$46,38,IF(CC20=$D$47,39,IF(CC20=$D$48,40,IF(CC20=$D$49,41,IF(CC20=$D$50,42,IF(CC20=$D$51,43,IF(CC20=$D$52,44,IF(CC20=$D$53,45,IF(CC20=$D$54,46,IF(CC20=$D$55,47,IF(CC20=$D$56,48,IF(CC20=$D$57,49,IF(CC20=$D$58,50,0))))))))))))))))))))))))))))))))))))))))))))))))))","v":25},null,null,null,null,null,"LAYER 7",null,{"$f":"SA_Inp2!D23","v":"---"},null,1,"---",null,null,"---",null,null,{"$f":"SA_Inp2!I23","v":"---"},null,1,"---",null,null,"---",null,null,"---",null,null,null,null,null,null,null,null,null,null,null,"F_ST_SS",null,{"$f":"DM13/DM14","v":3.7499999999999999E-3},null,null,null,null,null,null,null,null,null,null,null,null,null,null,null,null,null,null,null,null,null,null,null,null,null,null,null,null,null,null,null,null,null,null,null,null,null,null,null,null,null,null,null,null,null,null,null,null,null,null,null,null,null,null,null,null,null,null,null,null,"U",null,{"$f":"DY19","v":0.52993548533700119},null,null,{"$f":"DY64","v":0.45144597340390985},null,null,null,null,null,null,null,null,null,null,null,"LAYER 9",null,"---",null,null,"---",null,null,"---",null,null,"---",null,null,"kg SB-eq",null,null,"---",null,null,"MJ",null,null,"---",null,null,"kg SO2-eq",null,null,"---",null,null,"kg (PO4)3-eq",null,null,"---",null,null,"kg C2H4-eq",null,null,"---",null,null,"kg CO2-eq",null,null,"---",null,null,"kg CFC11-eq",null,null,null,null,null,"LAYER 10",null,"---",null,null,"---",null,null,"---",null,null,{"$f":"VLOOKUP(CO23,$C$9:$AV$61,10)","v":"---"},null,null,"---",null,null,"---",null,null,"---",null,null,"---",null,null,"---",null,null,"---",null,null,0,null,null,0,null,null,null,null,null,null,null,null,null,null,null,"EP",null,0.14000000000000001]
[null,null,13,{"$f":"Mat_DB!D24","v":"Mineral wool (10 mm) [Volcalis]"},{"$f":"Mat_DB!H24","v":"Cavity Insulation"},{"$f":"Mat_DB!J24","v":10},{"$f":"Mat_DB!L24","v":"λ [W/(m·K)]"},{"$f":"Mat_DB!K24","v":3.5000000000000003E-2},3.5000000000000003E-2,"---",{"$f":"Mat_DB!M24","v":"Volcalis"},{"$f":"IF(Mat_DB!O24=\"\",\"---\",Mat_DB!O24)","v":1},{"$f":"IF(Mat_DB!P24=\"\",\"---\",Mat_DB!P24)","v":"m²/m²"},{"$f":"IF(Mat_DB!Q24=\"\",\"---\",Mat_DB!Q24)","v":0.32400000000000007},"€/m²",{"$f":"Mat_DB!T24","v":1.1200000000000001E-5},"kg SB-eq/m²",{"$f":"Mat_DB!U24","v":3.4600000000000004},"MJ/m²",{"$f":"Mat_DB!V24","v":1.01E-3},"kg SO2-eq/m²",{"$f":"Mat_DB!W24","v":2.0799999999999999E-4},"kg (PO4)3-eq/m²",{"$f":"Mat_DB!X24","v":7.1799999999999997E-5},"kg C2H4-eq/m²",{"$f":"Mat_DB!Y24","v":0.16900000000000001},"kg CO2-eq/m²",{"$f":"Mat_DB!Z24","v":1.7699999999999999E-12},"kg CFC11-eq/m²",{"$f":"Mat_DB!AC24","v":"---"},"mm",{"$f":"Mat_DB!AD24","v":"---"},"mm",{"$f":"Mat_DB!AE24","v":"---"},"mm",1,2,2,2,null,"Layer","Material 1","Material 2","1x2","AC thickn.","R ISO6946","R AC","R1","R2","R Final",null,null,null,null,"Alcochete",23,null,"Entre Douro e Vouga",8,298,1544,1400,20.6,-3,null,13,{"$f":"Loc_DB!G24","v":"Coimbra_PT"},{"$f":"Loc_DB!J24","v":1485},{"$f":"Loc_DB!N24","v":87},null,null,null,"GL MF",null,{"$f":"SA_Inp1!K20","v":12},null,null,null,"SHT",null,{"$f":"SA_Inp2!R25","v":24.5},null,null,null,null,null,null,null,"LAYER 8",null,{"$f":"SA_Inp2!D24","v":"---"},null,1,"---",null,null,"---",null,null,{"$f":"SA_Inp2!I24","v":"---"},null,1,"---",null,null,"---",null,null,"---",null,null,null,null,null,null,null,null,null,null,null,"F_ST_SS-",null,{"$f":"1-DS20","v":0.99624999999999997},null,null,null,null,null,null,null,null,null,null,null,null,null,null,null,null,null,null,null,null,null,null,null,null,null,null,null,null,null,null,null,null,null,null,null,null,null,null,null,null,null,null,null,null,null,null,null,null,null,null,null,null,null,null,null,null,null,null,null,null,"A",null,{"$f":"(BW17*(100-BW21)*0.01+BW18*(100-BW22)*0.01+BW19*(100-BW23)*0.01+BW20*(100-BW24)*0.01)*BW25*BW26","v":239.76000000000005},null,null,{"$f":"(BW37*(100-BW41)*0.01+BW38*(100-BW42)*0.01+BW39*(100-BW43)*0.01+BW40*(100-BW44)*0.01)*BW45*BW46","v":239.76000000000005},null,null,null,null,null,null,null,null,null,null,null,"LAYER 10",null,"---",null,null,"---",null,null,"---",null,null,"---",null,null,"kg SB-eq",null,null,"---",null,null,"MJ",null,null,"---",null,null,"kg SO2-eq",null,null,"---",null,null,"kg (PO4)3-eq",null,null,"---",null,null,"kg C2H4-eq",null,null,"---",null,null,"kg CO2-eq",null,null,"---",null,null,"kg CFC11-eq",null,null,null,null,null,null,null,null,null,null,null,null,null,null,null,null,null,null,null,null,null,null,null,null,null,null,null,null,null,null,null,null,null,null,null,null,null,null,null,null,null,null,null,null,null,null,null,null,null,null,null,null,"POCP",null,0.14000000000000001]
[null,null,14,{"$f":"Mat_DB!D25","v":"Mineral wool (50 mm) [Volcalis]"},{"$f":"Mat_DB!H25","v":"Cavity Insulation"},{"$f":"Mat_DB!J25","v":50},{"$f":"Mat_DB!L25","v":"λ [W/(m·K)]"},{"$f":"Mat_DB!K25","v":3.5000000000000003E-2},3.5000000000000003E-2,"---",{"$f":"Mat_DB!M25","v":"Volcalis"},{"$f":"IF(Mat_DB!O25=\"\",\"---\",Mat_DB!O25)","v":1},{"$f":"IF(Mat_DB!P25=\"\",\"---\",Mat_DB!P25)","v":"m²/m²"},{"$f":"IF(Mat_DB!Q25=\"\",\"---\",Mat_DB!Q25)","v":1.62},"€/m²",{"$f":"Mat_DB!T25","v":5.5999999999999999E-5},"kg SB-eq/m²",{"$f":"Mat_DB!U25","v":17.3},"MJ/m²",{"$f":"Mat_DB!V25","v":5.0499999999999998E-3},"kg SO2-eq/m²",{"$f":"Mat_DB!W25","v":1.0399999999999999E-3},"kg (PO4)3-eq/m²",{"$f":"Mat_DB!X25","v":3.59E-4},"kg C2H4-eq/m²",{"$f":"Mat_DB!Y25","v":0.84499999999999997},"kg CO2-eq/m²",{"$f":"Mat_DB!Z25","v":8.8499999999999988E-12},"kg CFC11-eq/m²",{"$f":"Mat_DB!AC25","v":"---"},"mm",{"$f":"Mat_DB!AD25","v":"---"},"mm",{"$f":"Mat_DB!AE25","v":"---"},"mm",1,2,2,2,null,1,{"$f":"IF(VLOOKUP(CO14,$C$9:$AV$61,36)=7,2,1)","v":1},{"$f":"IF(VLOOKUP(CX14,$C$9:$AV$61,36)=6,2,1)","v":1},{"$f":"AP22*AQ22","v":1},{"$f":"IF(VLOOKUP(CO14,$C$9:$AV$61,36)=7,VLOOKUP(CO14,$C$9:$AV$61,4),0)","v":0},{"$f":"IF(AS22=5,0.11,IF(AS22=10,0.15,IF(AS22>=25,0.18,IF(AS22<5,0.11*(AS22/5),IF(AS22<10,0.11+((AS22-5)/5)*0.04,IF(AS22<15,0.15+((AS22-10)/5)*0.02,IF(AS22<25,0.17+((AS22-15)/10)*0.01,0)))))))","v":0},{"$f":"IF($AR$32=17,$AT$32*AS22/$AS$32,IF($AR$32=16,AT22,IF($AR$32=14,$AT$32*AS22/$AS$32,IF($AR$32=13,AT22,IF($AR$32=11,$AT$32,0)))))","v":0},{"$f":"IF(VLOOKUP(CO14,$C$9:$AV$61,36)=7,AU22,0)","v":0},{"$f":"IF(VLOOKUP(CO14,$C$9:$AV$61,35)=2,(DM32*0.001)/DN32,VLOOKUP(CO14,$C$9:$AV$61,8))","v":7.1428571428571438E-2},{"$f":"IF(VLOOKUP(CO14,$C$9:$AV$61,36)=7,AV22,AW22)","v":7.1428571428571438E-2},null,null,null,null,"Alcoutim",28,null,"Baixo Vouga",9,50,1337,1100,20.6,-2,null,14,{"$f":"Loc_DB!G25","v":"Madrid_SP"},{"$f":"Loc_DB!J25","v":2066},{"$f":"Loc_DB!N25","v":212},null,null,null,"GL BF",null,{"$f":"SA_Inp1!K21","v":12},null,null,null,"TBW",null,{"$f":"SA_Inp2!R22","v":0},null,null,null,null,null,null,null,"LAYER 9",null,{"$f":"SA_Inp2!D25","v":"---"},null,1,"---",null,null,"---",null,null,{"$f":"SA_Inp2!I25","v":"---"},null,1,"---",null,null,"---",null,null,"---",null,null,null,null,null,null,null,null,null,null,null,"F_TBW_SS",null,{"$f":"DM18/DM14","v":0},null,null,null,null,null,null,null,null,null,null,null,null,null,null,null,null,null,null,null,null,null,null,null,null,null,null,null,null,null,null,null,null,null,null,null,null,null,null,null,null,null,null,null,null,null,null,null,null,null,null,null,null,null,null,null,null,null,null,null,null,"COP",null,{"$f":"CC13","v":3.5},null,null,{"$f":"CC33","v":3.5},null,null,null,null,null,null,null,null,null,null,null,null,null,"Material 2",null,null,"Unit Consumption",null,null,null,null,null,"Indicator",null,null,null,null,null,"Indicator",null,null,null,null,null,"Indicator",null,null,null,null,null,"Indicator",null,null,null,null,null,"Indicator",null,null,null,null,null,"Indicator",null,null,null,null,null,"Indicator",null,null,null,null,null,null,null,null,null,null,null,null,null,null,null,null,null,null,null,null,null,null,null,null,null,null,null,null,null,null,null,null,null,null,null,null,null,null,null,null,null,null,null,null,null,null,null,null,null,null,null,null,null,null,null,"GWP",null,0.16]
[null,null,15,{"$f":"Mat_DB!D26","v":"Mineral wool (90 mm) [Volcalis]"},{"$f":"Mat_DB!H26","v":"Cavity Insulation"},{"$f":"Mat_DB!J26","v":90},{"$f":"Mat_DB!L26","v":"λ [W/(m·K)]"},{"$f":"Mat_DB!K26","v":3.5000000000000003E-2},3.5000000000000003E-2,"---",{"$f":"Mat_DB!M26","v":"Volcalis"},{"$f":"IF(Mat_DB!O26=\"\",\"---\",Mat_DB!O26)","v":1},{"$f":"IF(Mat_DB!P26=\"\",\"---\",Mat_DB!P26)","v":"m²/m²"},{"$f":"IF(Mat_DB!Q26=\"\",\"---\",Mat_DB!Q26)","v":2.9160000000000004},"€/m²",{"$f":"Mat_DB!T26","v":1.008E-4},"kg SB-eq/m²",{"$f":"Mat_DB!U26","v":31.14},"MJ/m²",{"$f":"Mat_DB!V26","v":9.0899999999999991E-3},"kg SO2-eq/m²",{"$f":"Mat_DB!W26","v":1.872E-3},"kg (PO4)3-eq/m²",{"$f":"Mat_DB!X26","v":6.4619999999999999E-4},"kg C2H4-eq/m²",{"$f":"Mat_DB!Y26","v":1.5209999999999999},"kg CO2-eq/m²",{"$f":"Mat_DB!Z26","v":1.5929999999999997E-11},"kg CFC11-eq/m²",{"$f":"Mat_DB!AC26","v":"---"},"mm",{"$f":"Mat_DB!AD26","v":"---"},"mm",{"$f":"Mat_DB!AE26","v":"---"},"mm",1,2,2,2,null,2,1,1,{"$f":"AP23*AQ23","v":1},0,{"$f":"IF(AS23=5,0.11,IF(AS23=10,0.15,IF(AS23>=25,0.18,IF(AS23<5,0.11*(AS23/5),IF(AS23<10,0.11+((AS23-5)/5)*0.04,IF(AS23<15,0.15+((AS23-10)/5)*0.02,IF(AS23<25,0.17+((AS23-15)/10)*0.01,0)))))))","v":0},{"$f":"IF($AR$32=17,$AT$32*AS23/$AS$32,IF($AR$32=16,AT23,IF($AR$32=14,$AT$32*AS23/$AS$32,IF($AR$32=13,AT23,IF($AR$32=11,$AT$32,0)))))","v":0},0,9.2307692307692313E-2,9.2307692307692313E-2,null,null,null,null,"Alenquer",19,null,"Baixo Mondego",10,67,1304,1000,20.9,0,null,15,{"$f":"Loc_DB!G26","v":"Marseille_FR"},{"$f":"Loc_DB!J26","v":1776},{"$f":"Loc_DB!N26","v":106},null,null,null,"GL LF",null,{"$f":"SA_Inp1!K22","v":10},null,null,null,null,null,null,null,null,null,null,null,null,null,"LAYER 10",null,{"$f":"SA_Inp2!D26","v":"---"},null,1,"---",null,null,"---",null,null,{"$f":"SA_Inp2!I26","v":"---"},null,1,"---",null,null,"---",null,null,"---",null,null,null,null,null,null,null,null,null,null,null,"F_TBW_SS-",null,{"$f":"1-DS22","v":1},null,null,null,null,null,null,null,null,null,null,null,null,null,null,null,null,null,null,null,null,null,null,null,null,null,null,null,null,null,null,null,null,null,null,null,null,null,null,null,null,null,null,null,null,null,null,null,null,null,null,null,null,null,null,null,null,null,null,null,null,"EER",null,{"$f":"CC14","v":3.5},null,null,{"$f":"CC34","v":3.5},null,null,"DIFFERENCE",null,null,null,null,null,null,null,null,"LAYER 1",null,{"$f":"CV14","v":"---"},null,null,{"$f":"IF(VLOOKUP(CX14,$C$9:$AV$61,36)=1,$AP$17,IF(VLOOKUP(CX14,$C$9:$AV$61,36)=6,$AP$17,VLOOKUP(CX14,$C$9:$AV$61,10)))","v":"---"},null,null,{"$f":"VLOOKUP(CX14,$C$9:$AV$61,11)","v":"---"},null,null,{"$f":"VLOOKUP(CX14,$C$9:$AV$61,14)","v":"---"},null,null,"kg SB-eq",null,null,{"$f":"VLOOKUP(CX14,$C$9:$AV$61,16)","v":"---"},null,null,"MJ",null,null,{"$f":"VLOOKUP(CX14,$C$9:$AV$61,18)","v":"---"},null,null,"kg SO2-eq",null,null,{"$f":"VLOOKUP(CX14,$C$9:$AV$61,20)","v":"---"},null,null,"kg (PO4)3-eq",null,null,{"$f":"VLOOKUP(CX14,$C$9:$AV$61,22)","v":"---"},null,null,"kg C2H4-eq",null,null,{"$f":"VLOOKUP(CX14,$C$9:$AV$61,24)","v":"---"},null,null,"kg CO2-eq",null,null,{"$f":"VLOOKUP(CX14,$C$9:$AV$61,26)","v":"---"},null,null,"kg CFC11-eq",null,null,null,null,null,null,null,null,null,null,null,null,null,null,null,null,null,null,null,null,null,null,null,null,null,null,null,null,null,null,null,null,null,null,null,null,null,null,null,null,null,null,null,null,null,null,null,null,null,null,null,null,"ODP",null,0.14000000000000001]
[null,null,16,{"$f":"Mat_DB!D27","v":"Mineral wool (100 mm) [Volcalis]"},{"$f":"Mat_DB!H27","v":"Cavity Insulation"},{"$f":"Mat_DB!J27","v":100},{"$f":"Mat_DB!L27","v":"λ [W/(m·K)]"},{"$f":"Mat_DB!K27","v":3.5000000000000003E-2},3.5000000000000003E-2,"---",{"$f":"Mat_DB!M27","v":"Volcalis"},{"$f":"IF(Mat_DB!O27=\"\",\"---\",Mat_DB!O27)","v":1},{"$f":"IF(Mat_DB!P27=\"\",\"---\",Mat_DB!P27)","v":"m²/m²"},{"$f":"IF(Mat_DB!Q27=\"\",\"---\",Mat_DB!Q27)","v":3.24},"€/m²",{"$f":"Mat_DB!T27","v":1.12E-4},"kg SB-eq/m²",{"$f":"Mat_DB!U27","v":34.6},"MJ/m²",{"$f":"Mat_DB!V27","v":1.01E-2},"kg SO2-eq/m²",{"$f":"Mat_DB!W27","v":2.0799999999999998E-3},"kg (PO4)3-eq/m²",{"$f":"Mat_DB!X27","v":7.18E-4},"kg C2H4-eq/m²",{"$f":"Mat_DB!Y27","v":1.69},"kg CO2-eq/m²",{"$f":"Mat_DB!Z27","v":1.7699999999999998E-11},"kg CFC11-eq/m²",{"$f":"Mat_DB!AC27","v":"---"},"mm",{"$f":"Mat_DB!AD27","v":"---"},"mm",{"$f":"Mat_DB!AE27","v":"---"},"mm",1,2,2,2,null,3,1,1,1,0,0,0,0,2.5714285714285712,2.5714285714285712,null,null,null,null,"Alfândega da Fé",2,null,"Beira Interior Norte",11,717,1924,1000,21.7,-5,null,16,{"$f":"Loc_DB!G27","v":"Rome_IT"},{"$f":"Loc_DB!J27","v":1508},{"$f":"Loc_DB!N27","v":73},null,null,null,"GL RF",null,{"$f":"SA_Inp1!K23","v":10},null,null,null,null,null,null,null,null,null,null,null,null,null,null,null,null,null,null,null,null,null,null,null,null,null,null,null,null,null,null,"TOTAL",null,null,{"$f":"SUM(DE14:DG23)","v":136.5},null,null,null,null,null,null,null,null,null,null,null,null,null,null,null,null,null,null,null,null,null,null,null,null,null,null,null,null,null,null,null,null,null,null,null,null,null,null,null,null,null,null,null,null,null,null,null,null,null,null,null,null,null,null,null,null,null,null,null,null,null,null,null,null,null,null,null,null,null,null,null,null,null,null,"HUFE",null,{"$f":"GD20*GD18*0.024/GD22","v":4.7676024463689979},null,null,{"$f":"GG20*GG18*0.024/GG22","v":4.0614659458692319},null,null,{"$f":"GD24-GG24","v":0.70613650049976595},null,null,null,null,null,null,null,null,"LAYER 2",null,"---",null,null,"---",null,null,"---",null,null,"---",null,null,"kg SB-eq",null,null,"---",null,null,"MJ",null,null,"---",null,null,"kg SO2-eq",null,null,"---",null,null,"kg (PO4)3-eq",null,null,"---",null,null,"kg C2H4-eq",null,null,"---",null,null,"kg CO2-eq",null,null,"---",null,null,"kg CFC11-eq",null,null,null,null,null,"SOLUTION B"]
[null,null,17,{"$f":"Mat_DB!D28","v":"Mineral wool (120 mm) [Volcalis]"},{"$f":"Mat_DB!H28","v":"Cavity Insulation"},{"$f":"Mat_DB!J28","v":120},{"$f":"Mat_DB!L28","v":"λ [W/(m·K)]"},{"$f":"Mat_DB!K28","v":3.5000000000000003E-2},3.5000000000000003E-2,"---",{"$f":"Mat_DB!M28","v":"Volcalis"},{"$f":"IF(Mat_DB!O28=\"\",\"---\",Mat_DB!O28)","v":1},{"$f":"IF(Mat_DB!P28=\"\",\"---\",Mat_DB!P28)","v":"m²/m²"},{"$f":"IF(Mat_DB!Q28=\"\",\"---\",Mat_DB!Q28)","v":3.8879999999999999},"€/m²",{"$f":"Mat_DB!T28","v":1.3439999999999999E-4},"kg SB-eq/m²",{"$f":"Mat_DB!U28","v":41.52},"MJ/m²",{"$f":"Mat_DB!V28","v":1.2119999999999999E-2},"kg SO2-eq/m²",{"$f":"Mat_DB!W28","v":2.4959999999999995E-3},"kg (PO4)3-eq/m²",{"$f":"Mat_DB!X28","v":8.6160000000000002E-4},"kg C2H4-eq/m²",{"$f":"Mat_DB!Y28","v":2.028},"kg CO2-eq/m²",{"$f":"Mat_DB!Z28","v":2.1239999999999996E-11},"kg CFC11-eq/m²",{"$f":"Mat_DB!AC28","v":"---"},"mm",{"$f":"Mat_DB!AD28","v":"---"},"mm",{"$f":"Mat_DB!AE28","v":"---"},"mm",1,2,2,2,null,4,1,1,1,0,0,0,0,9.2307692307692313E-2,9.2307692307692313E-2,null,null,null,null,"Alijó",7,null,"Beira Interior Sul",12,328,1274,1800,25.3,-7,null,17,{"$f":"Loc_DB!G28","v":0},{"$f":"Loc_DB!J28","v":0},{"$f":"Loc_DB!N28","v":0},null,null,null,"# FLOORS",null,{"$f":"SA_Inp1!E26","v":2},null,null,null,null,null,null,null,null,null,null,null,null,null,null,null,null,null,null,null,null,null,null,null,null,null,null,null,null,null,null,null,null,null,null,null,null,null,null,null,null,null,null,null,null,null,null,null,null,null,null,null,null,null,null,null,null,null,null,null,null,null,null,null,null,null,null,null,null,null,null,null,null,null,null,null,null,null,null,null,null,null,null,null,null,null,null,null,null,null,null,null,null,null,null,null,null,null,null,null,null,null,null,null,null,null,null,null,null,"HTFE",null,{"$f":"GD24*GD21","v":1143.0803625414312},null,null,{"$f":"GG24*GG21","v":973.77707518160719},null,null,169.30328735982403,null,null,null,null,null,null,null,null,"LAYER 3",null,"Steel C90/U93 (90 mm) [Pertecno]",null,null,{"$f":"IF(VLOOKUP(CX16,$C$9:$AV$61,36)=1,$AP$17,IF(VLOOKUP(CX16,$C$9:$AV$61,36)=6,$AP$17,VLOOKUP(CX16,$C$9:$AV$61,10)))","v":3.3074074074074078},null,null,"m/m²",null,null,{"$f":"VLOOKUP(CX16,$C$9:$AV$61,14)","v":1.3118837600000001E-7},null,null,"kg SB-eq",null,null,{"$f":"VLOOKUP(CX16,$C$9:$AV$61,16)","v":72.901300000000006},null,null,"MJ",null,null,{"$f":"VLOOKUP(CX16,$C$9:$AV$61,18)","v":2.5764120000000004E-5},null,null,"kg SO2-eq",null,null,{"$f":"VLOOKUP(CX16,$C$9:$AV$61,20)","v":1.501694E-6},null,null,"kg (PO4)3-eq",null,null,{"$f":"VLOOKUP(CX16,$C$9:$AV$61,22)","v":4.6603460000000003E-4},null,null,"kg C2H4-eq",null,null,{"$f":"VLOOKUP(CX16,$C$9:$AV$61,24)","v":5.5312800000000013E-3},null,null,"kg CO2-eq",null,null,{"$f":"VLOOKUP(CX16,$C$9:$AV$61,26)","v":0},null,null,"kg CFC11-eq"]
[null,null,18,{"$f":"Mat_DB!D29","v":"Mineral wool (200 mm) [Volcalis]"},{"$f":"Mat_DB!H29","v":"Cavity Insulation"},{"$f":"Mat_DB!J29","v":200},{"$f":"Mat_DB!L29","v":"λ [W/(m·K)]"},{"$f":"Mat_DB!K29","v":3.5000000000000003E-2},3.5000000000000003E-2,"---",{"$f":"Mat_DB!M29","v":"Volcalis"},{"$f":"IF(Mat_DB!O29=\"\",\"---\",Mat_DB!O29)","v":1},{"$f":"IF(Mat_DB!P29=\"\",\"---\",Mat_DB!P29)","v":"m²/m²"},{"$f":"IF(Mat_DB!Q29=\"\",\"---\",Mat_DB!Q29)","v":6.48},"€/m²",{"$f":"Mat_DB!T29","v":2.24E-4},"kg SB-eq/m²",{"$f":"Mat_DB!U29","v":69.2},"MJ/m²",{"$f":"Mat_DB!V29","v":2.0199999999999999E-2},"kg SO2-eq/m²",{"$f":"Mat_DB!W29","v":4.1599999999999996E-3},"kg (PO4)3-eq/m²",{"$f":"Mat_DB!X29","v":1.436E-3},"kg C2H4-eq/m²",{"$f":"Mat_DB!Y29","v":3.38},"kg CO2-eq/m²",{"$f":"Mat_DB!Z29","v":3.5399999999999995E-11},"kg CFC11-eq/m²",{"$f":"Mat_DB!AC29","v":"---"},"mm",{"$f":"Mat_DB!AD29","v":"---"},"mm",{"$f":"Mat_DB!AE29","v":"---"},"mm",1,2,2,2,null,5,1,1,1,0,0,0,0,5.5555555555555558E-3,5.5555555555555558E-3,null,null,null,null,"Aljezur",28,null,"Cova da Beira",13,507,1687,1400,22.5,-6,null,18,{"$f":"Loc_DB!G29","v":0},{"$f":"Loc_DB!J29","v":0},{"$f":"Loc_DB!N29","v":0},null,null,null,"FLOOR HEIGHT",null,{"$f":"SA_Inp1!E27","v":2.7},null,null,null,null,null,null,null,null,null,null,null,null,null,null,null,null,null,null,null,null,null,null,null,null,null,null,null,null,null,null,null,null,null,null,null,null,null,null,null,null,null,null,null,null,null,null,null,null,null,null,null,null,null,null,null,null,null,null,"ISO 6946 COMBINED METHOD",null,null,null,null,null,null,null,"GORGOLEWSKI METHOD 1",null,null,null,null,null,null,null,"GORGOLEWSKI METHOD 2",null,null,null,null,null,null,null,"GORGOLEWSKI METHOD 3",null,null,null,null,null,null,null,"ASHRAE ZONE METHOD",null,null,null,null,null,null,null,null,null,null,null,null,null,null,null,null,null,"CUFE",null,{"$f":"GD20*0.001*(25-GD19)*2928/GD23","v":1.8176484326781814},null,null,{"$f":"GG20*0.001*(25-GG19)*2928/GG23","v":1.5484338918626452},null,null,0.2692145408155362,null,null,null,null,null,null,null,null,"LAYER 4",null,"---",null,null,{"$f":"IF(VLOOKUP(CX17,$C$9:$AV$61,36)=1,$AP$17,IF(VLOOKUP(CX17,$C$9:$AV$61,36)=6,$AP$17,VLOOKUP(CX17,$C$9:$AV$61,10)))","v":"---"},null,null,"---",null,null,{"$f":"VLOOKUP(CX17,$C$9:$AV$61,14)","v":"---"},null,null,"kg SB-eq",null,null,{"$f":"VLOOKUP(CX17,$C$9:$AV$61,16)","v":"---"},null,null,"MJ",null,null,{"$f":"VLOOKUP(CX17,$C$9:$AV$61,18)","v":"---"},null,null,"kg SO2-eq",null,null,{"$f":"VLOOKUP(CX17,$C$9:$AV$61,20)","v":"---"},null,null,"kg (PO4)3-eq",null,null,{"$f":"VLOOKUP(CX17,$C$9:$AV$61,22)","v":"---"},null,null,"kg C2H4-eq",null,null,{"$f":"VLOOKUP(CX17,$C$9:$AV$61,24)","v":"---"},null,null,"kg CO2-eq",null,null,{"$f":"VLOOKUP(CX17,$C$9:$AV$61,26)","v":"---"},null,null,"kg CFC11-eq",null,null,null,null,null,null,null,null,null,null,null,null,null,null,null,null,null,null,null,null,null,null,null,null,null,null,null,null,null,null,null,null,null,null,null,null,null,null,null,null,null,null,null,null,null,null,null,null,null,null,null,null,"LCA EVALUATION",null,null,null,null,null,null,null,null,null,"Matrix",null,null,null,null,null,"Info"]
[null,null,19,{"$f":"Mat_DB!D30","v":"ETICS EPS (40 mm) [Weber]"},{"$f":"Mat_DB!H30","v":"External Insulation"},{"$f":"Mat_DB!J30","v":40},{"$f":"Mat_DB!L30","v":"R [(m²·K)/W]"},{"$f":"Mat_DB!K30","v":1.1499999999999999},"---",1.1499999999999999,{"$f":"Mat_DB!M30","v":"Cype"},{"$f":"IF(Mat_DB!O30=\"\",\"---\",Mat_DB!O30)","v":1},{"$f":"IF(Mat_DB!P30=\"\",\"---\",Mat_DB!P30)","v":"m²/m²"},{"$f":"IF(Mat_DB!Q30=\"\",\"---\",Mat_DB!Q30)","v":34.200000000000003},"€/m²",{"$f":"Mat_DB!T30","v":5.2000000000000005E-2},"kg SB-eq/m²",{"$f":"Mat_DB!U30","v":79.52000000000001},"MJ/m²",{"$f":"Mat_DB!V30","v":1.5120000000000003E-2},"kg SO2-eq/m²",{"$f":"Mat_DB!W30","v":1.7200000000000002E-3},"kg (PO4)3-eq/m²",{"$f":"Mat_DB!X30","v":1.8400000000000001E-3},"kg C2H4-eq/m²",{"$f":"Mat_DB!Y30","v":4.7600000000000007},"kg CO2-eq/m²",{"$f":"Mat_DB!Z30","v":5.2253600000000012E-7},"kg CFC11-eq/m²",{"$f":"Mat_DB!AC30","v":"---"},"mm",{"$f":"Mat_DB!AD30","v":"---"},"mm",{"$f":"Mat_DB!AE30","v":"---"},"mm",1,1,3,2,null,6,1,1,1,0,0,0,0,"---","---",null,null,null,null,"Aljustrel",27,null,"Serra da Estrela",14,553,1851,1600,21,-4,null,19,{"$f":"Loc_DB!G30","v":0},{"$f":"Loc_DB!J30","v":0},{"$f":"Loc_DB!N30","v":0},null,null,null,null,null,null,null,null,null,null,null,null,null,null,null,null,null,null,null,null,null,null,null,null,null,null,null,null,null,null,null,null,null,null,null,null,null,null,null,null,null,null,null,null,null,null,null,null,null,null,null,null,null,null,null,null,null,null,null,null,null,null,null,null,null,null,null,null,null,null,null,null,null,null,null,null,null,null,null,null,null,null,null,null,null,null,null,null,null,null,null,null,null,null,null,null,null,null,null,null,null,null,null,null,null,null,null,null,null,null,null,null,null,null,"CTFE",null,{"$f":"GD26*GD21","v":435.79938821892085},null,null,{"$f":"GG26*GG21","v":371.25250991298788},null,null,64.546878305932978,null,null,null,null,null,null,null,null,"LAYER 5",null,"---",null,null,"---",null,null,"---",null,null,"---",null,null,"kg SB-eq",null,null,"---",null,null,"MJ",null,null,"---",null,null,"kg SO2-eq",null,null,"---",null,null,"kg (PO4)3-eq",null,null,"---",null,null,"kg C2H4-eq",null,null,"---",null,null,"kg CO2-eq",null,null,"---",null,null,"kg CFC11-eq",null,null,null,null,null,null,null,"Material 1",null,null,"Unit Cost",null,null,null,null,null,"Unit Consumption",null,null,null,null,null,"Material 2",null,null,"Unit Cost",null,null,null,null,null,"Unit Consumption",null,null,null,null,null,"Custo 1",null,null,"Custo 2",null,null,null,"COST B"]
[null,null,20,{"$f":"Mat_DB!D31","v":"ETICS EPS (50 mm) [Weber]"},{"$f":"Mat_DB!H31","v":"External Insulation"},{"$f":"Mat_DB!J31","v":50},{"$f":"Mat_DB!L31","v":"R [(m²·K)/W]"},{"$f":"Mat_DB!K31","v":1.4375},"---",1.4375,{"$f":"Mat_DB!M31","v":"Cype"},{"$f":"IF(Mat_DB!O31=\"\",\"---\",Mat_DB!O31)","v":1},{"$f":"IF(Mat_DB!P31=\"\",\"---\",Mat_DB!P31)","v":"m²/m²"},{"$f":"IF(Mat_DB!Q31=\"\",\"---\",Mat_DB!Q31)","v":35.725000000000001},"€/m²",{"$f":"Mat_DB!T31","v":6.5000000000000002E-2},"kg SB-eq/m²",{"$f":"Mat_DB!U31","v":99.4},"MJ/m²",{"$f":"Mat_DB!V31","v":1.8900000000000004E-2},"kg SO2-eq/m²",{"$f":"Mat_DB!W31","v":2.15E-3},"kg (PO4)3-eq/m²",{"$f":"Mat_DB!X31","v":2.3E-3},"kg C2H4-eq/m²",{"$f":"Mat_DB!Y31","v":5.95},"kg CO2-eq/m²",{"$f":"Mat_DB!Z31","v":6.5317000000000007E-7},"kg CFC11-eq/m²",{"$f":"Mat_DB!AC31","v":"---"},"mm",{"$f":"Mat_DB!AD31","v":"---"},"mm",{"$f":"Mat_DB!AE31","v":"---"},"mm",1,1,3,2,null,7,1,1,1,0,0,0,0,"---","---",null,null,null,null,"Almada",23,null,"Dão-Lafões",15,497,1702,1900,21.2,-3,null,20,{"$f":"Loc_DB!G31","v":0},{"$f":"Loc_DB!J31","v":0},{"$f":"Loc_DB!N31","v":0},null,null,null,"SOLUTION B",null,null,null,null,null,null,null,null,null,null,null,null,null,null,null,null,null,null,null,null,null,null,null,null,null,null,null,null,null,null,null,null,null,null,null,null,null,null,null,null,null,null,null,null,null,null,null,null,null,null,null,null,null,null,null,null,null,null,null,null,null,null,null,null,null,null,null,null,null,null,null,null,null,null,null,null,null,null,null,null,null,null,null,null,null,null,null,null,null,null,null,null,null,null,null,null,null,null,null,null,null,null,null,null,null,null,null,null,null,null,"UFE",null,{"$f":"GD24+GD26","v":6.5852508790471793},null,null,{"$f":"GG24+GG26","v":5.6098998377318772},null,null,0.97535104131530215,null,null,"% SAVED ENERGY",null,null,null,null,null,"LAYER 6",null,"---",null,null,"---",null,null,"---",null,null,"---",null,null,"kg SB-eq",null,null,"---",null,null,"MJ",null,null,"---",null,null,"kg SO2-eq",null,null,"---",null,null,"kg (PO4)3-eq",null,null,"---",null,null,"kg C2H4-eq",null,null,"---",null,null,"kg CO2-eq",null,null,"---",null,null,"kg CFC11-eq",null,null,null,null,null,"LAYER 1",null,{"$f":"CM34","v":"Gypsum Board (12,5 mm) [Gyptec]"},null,null,{"$f":"VLOOKUP(CO34,$C$9:$AV$61,12)","v":3.25},null,null,{"$f":"VLOOKUP(CO34,$C$9:$AV$61,13)","v":"€/m²"},null,null,{"$f":"IF(VLOOKUP(CO34,$C$9:$AV$61,36)=7,1,VLOOKUP(CO34,$C$9:$AV$61,10))","v":1},null,null,{"$f":"VLOOKUP(CO34,$C$9:$AV$61,11)","v":"m²/m²"},null,null,{"$f":"CV34","v":"---"},null,null,{"$f":"VLOOKUP(CX34,$C$9:$AV$61,12)","v":"---"},null,null,{"$f":"VLOOKUP(CX34,$C$9:$AV$61,13)","v":"---"},null,null,{"$f":"IF(VLOOKUP(CX34,$C$9:$AV$61,36)=1,$AT$17,IF(VLOOKUP(CX34,$C$9:$AV$61,36)=6,$AT$17,VLOOKUP(CX34,$C$9:$AV$61,10)))","v":"---"},null,null,{"$f":"VLOOKUP(CX34,$C$9:$AV$61,11)","v":"---"},null,null,{"$f":"IF(CO34=1,0,JB28*JH28)","v":3.25},null,null,{"$f":"IF(CX34=1,0,JQ28*JW28)","v":0},null,null,null,null,null,null,null,null,null,null,null,null,null,"A","B","A","B","Weights","A","B",null,{"$f":"IF(KT29<KU29,1,IF(KT29>KU29,4,5))","v":1},{"$f":"IF(KT29<0,1,IF(KT29>0,2,5))","v":2},{"$f":"IF(KU29<0,3,IF(KU29>0,4,3))","v":4},{"$f":"LC28*LD28","v":8},{"$f":"LE28*LB28","v":8},null,"++","+",32]
[null,null,21,{"$f":"Mat_DB!D32","v":"ETICS EPS (70 mm) [Weber]"},{"$f":"Mat_DB!H32","v":"External Insulation"},{"$f":"Mat_DB!J32","v":70},{"$f":"Mat_DB!L32","v":"R [(m²·K)/W]"},{"$f":"Mat_DB!K32","v":2.0124999999999997},"---",2.0124999999999997,{"$f":"Mat_DB!M32","v":"Cype"},{"$f":"IF(Mat_DB!O32=\"\",\"---\",Mat_DB!O32)","v":1},{"$f":"IF(Mat_DB!P32=\"\",\"---\",Mat_DB!P32)","v":"m²/m²"},{"$f":"IF(Mat_DB!Q32=\"\",\"---\",Mat_DB!Q32)","v":38.775000000000006},"€/m²",{"$f":"Mat_DB!T32","v":9.0999999999999998E-2},"kg SB-eq/m²",{"$f":"Mat_DB!U32","v":139.16},"MJ/m²",{"$f":"Mat_DB!V32","v":2.6460000000000004E-2},"kg SO2-eq/m²",{"$f":"Mat_DB!W32","v":3.0099999999999997E-3},"kg (PO4)3-eq/m²",{"$f":"Mat_DB!X32","v":3.2199999999999998E-3},"kg C2H4-eq/m²",{"$f":"Mat_DB!Y32","v":8.33},"kg CO2-eq/m²",{"$f":"Mat_DB!Z32","v":9.1443800000000008E-7},"kg CFC11-eq/m²",{"$f":"Mat_DB!AC32","v":"---"},"mm",{"$f":"Mat_DB!AD32","v":"---"},"mm",{"$f":"Mat_DB!AE32","v":"---"},"mm",1,1,3,2,null,8,1,1,1,0,0,0,0,"---","---",null,null,null,null,"Almeida",11,null,"Pinhal Interior Norte",16,361,1555,1600,21.2,-2,null,21,{"$f":"Loc_DB!G32","v":0},{"$f":"Loc_DB!J32","v":0},{"$f":"Loc_DB!N32","v":0},null,null,null,null,null,null,null,null,null,null,null,null,null,null,null,null,null,null,null,null,null,null,null,null,null,null,null,null,null,null,null,null,null,null,null,null,null,null,null,null,null,null,null,null,null,null,null,null,null,null,null,null,null,null,null,null,null,null,null,null,null,null,null,null,"PARALLEL PATH METHOD",null,null,null,"ISOTHERMAL PLANE METHOD",null,null,null,"PARALLEL PATH METHOD",null,null,null,"ISOTHERMAL PLANE METHOD",null,null,null,"PARALLEL PATH METHOD",null,null,null,"ISOTHERMAL PLANE METHOD",null,null,null,"PARALLEL PATH METHOD",null,null,null,"ISOTHERMAL PLANE METHOD",null,null,null,"Zone CAV",null,null,null,"Zone W",null,null,null,null,null,null,null,null,null,null,null,null,null,"TFE",null,{"$f":"GD25+GD27","v":1578.8797507603522},null,null,{"$f":"GG25+GG27","v":1345.0295850945949},null,null,233.85016566575723,null,null,{"$f":"1-GG29/GD29","v":0.14811144772307094},null,null,null,null,null,"LAYER 7",null,"---",null,null,"---",null,null,"---",null,null,"---",null,null,"kg SB-eq",null,null,"---",null,null,"MJ",null,null,"---",null,null,"kg SO2-eq",null,null,"---",null,null,"kg (PO4)3-eq",null,null,"---",null,null,"kg C2H4-eq",null,null,"---",null,null,"kg CO2-eq",null,null,"---",null,null,"kg CFC11-eq",null,null,null,null,null,"LAYER 2",null,"OSB (12 mm) [Kronospan]",null,null,7.32,null,null,"€/m²",null,null,1,null,null,"m²/m²",null,null,"---",null,null,"---",null,null,"---",null,null,"---",null,null,"---",null,null,7.32,null,null,{"$f":"IF(CX35=1,0,JQ29*JW29)","v":0},null,null,null,"Unit",null,{"$f":"SUM(KC28:KE37)+SUM(KF28:KH37)","v":44.462423185185195},null,null,null,null,null,"ADPE",null,{"$f":"HD33+0.00000001","v":1.0660118837599998E-4},{"$f":"HD60+0.00000001","v":1.0735412955247057E-4},{"$f":"IF(LF28=32,KT29,IF(LF28=8,KT29,IF(LF28=3,KT29-2*KT29,IF(LF28=12,KU29-2*KU29+KT29-KU29,IF(LF28=24,-KU29+KT29-KU29,IF(LF28=4,-KT29,10))))))","v":1.0660118837599998E-4},{"$f":"IF(LF28=32,KU29,IF(LF28=8,KU29,IF(LF28=3,KT29-2*KT29+KU29-KT29,IF(LF28=12,KU29-2*KU29,IF(LF28=24,-KU29,IF(LF28=4,-KT29+KU29-KT29,10))))))","v":1.0735412955247057E-4},{"$f":"KT17","v":0.14000000000000001},{"$f":"IF(KV29=10,1,SMALL(KV29:KW29,1)/KV29)","v":1},{"$f":"IF(KV29=10,1,SMALL(KV29:KW29,1)/KW29)","v":0.99298637900927156},null,1,2,4,8,8,null,"+","++",8]
[null,null,22,{"$f":"Mat_DB!D33","v":"ETICS EPS (100 mm) [Weber]"},{"$f":"Mat_DB!H33","v":"External Insulation"},{"$f":"Mat_DB!J33","v":100},{"$f":"Mat_DB!L33","v":"R [(m²·K)/W]"},{"$f":"Mat_DB!K33","v":2.875},"---",2.875,{"$f":"Mat_DB!M33","v":"Cype"},{"$f":"IF(Mat_DB!O33=\"\",\"---\",Mat_DB!O33)","v":1},{"$f":"IF(Mat_DB!P33=\"\",\"---\",Mat_DB!P33)","v":"m²/m²"},{"$f":"IF(Mat_DB!Q33=\"\",\"---\",Mat_DB!Q33)","v":43.35},"€/m²",{"$f":"Mat_DB!T33","v":0.13},"kg SB-eq/m²",{"$f":"Mat_DB!U33","v":198.8},"MJ/m²",{"$f":"Mat_DB!V33","v":3.7800000000000007E-2},"kg SO2-eq/m²",{"$f":"Mat_DB!W33","v":4.3E-3},"kg (PO4)3-eq/m²",{"$f":"Mat_DB!X33","v":4.5999999999999999E-3},"kg C2H4-eq/m²",{"$f":"Mat_DB!Y33","v":11.9},"kg CO2-eq/m²",{"$f":"Mat_DB!Z33","v":1.3063400000000001E-6},"kg CFC11-eq/m²",{"$f":"Mat_DB!AC33","v":"---"},"mm",{"$f":"Mat_DB!AD33","v":"---"},"mm",{"$f":"Mat_DB!AE33","v":"---"},"mm",1,1,3,2,null,9,1,1,1,0,0,0,0,"---","---",null,null,null,null,"Almeirim",21,null,"Pinhal Interior Sul",17,361,1511,1500,22.4,-3,null,22,{"$f":"Loc_DB!G33","v":0},{"$f":"Loc_DB!J33","v":0},{"$f":"Loc_DB!N33","v":0},null,null,null,null,null,null,null,null,null,null,null,null,null,null,null,null,null,null,null,null,null,null,null,null,null,null,null,null,null,null,null,null,null,null,null,null,null,null,null,null,null,null,null,null,null,null,null,null,null,null,null,null,null,null,null,null,null,null,null,null,null,null,null,null,"Path A",null,"Path B",null,null,null,null,null,"Path A",null,"Path B",null,null,null,null,null,"Path A",null,"Path B",null,null,null,null,null,"Path A",null,"Path B",null,null,null,null,null,null,null,null,null,null,null,null,null,null,null,null,null,null,null,null,null,null,null,null,null,null,null,null,null,null,null,null,null,null,null,null,null,null,null,null,"LAYER 8",null,"---",null,null,"---",null,null,"---",null,null,"---",null,null,"kg SB-eq",null,null,"---",null,null,"MJ",null,null,"---",null,null,"kg SO2-eq",null,null,"---",null,null,"kg (PO4)3-eq",null,null,"---",null,null,"kg C2H4-eq",null,null,"---",null,null,"kg CO2-eq",null,null,"---",null,null,"kg CFC11-eq",null,null,null,null,null,"LAYER 3",null,"Air Cavity (10 mm) [ISO 6946]",null,null,0,null,null,"€/m²",null,null,{"$f":"IF(VLOOKUP(CO36,$C$9:$AV$61,36)=7,1,VLOOKUP(CO36,$C$9:$AV$61,10))","v":1},null,null,"m²/m²",null,null,"TB Strip XPS (10 mm) [IFoam]",null,null,{"$f":"VLOOKUP(CX36,$C$9:$AV$61,12)","v":0.09},null,null,"€/m²",null,null,3.3074074074074078,null,null,"m²/m²",null,null,0,null,null,{"$f":"IF(CX36=1,0,JQ30*JW30)","v":0.29766666666666669},null,null,null,"Total",null,{"$f":"KL29*GG36","v":10660.310582880003},null,null,null,null,null,"ADPF",null,{"$f":"HJ33+0.00000001","v":216.16130000999999},{"$f":"HJ60+0.00000001","v":249.04365295117645},216.16130000999999,249.04365295117645,0.14000000000000001,1,0.86796550503689063,null,1,2,4,8,8,null,"--","-",3]
[null,null,23,{"$f":"Mat_DB!D34","v":"ETICS EPS (120 mm) [Weber]"},{"$f":"Mat_DB!H34","v":"External Insulation"},{"$f":"Mat_DB!J34","v":120},{"$f":"Mat_DB!L34","v":"R [(m²·K)/W]"},{"$f":"Mat_DB!K34","v":3.4499999999999997},"---",3.4499999999999997,{"$f":"Mat_DB!M34","v":"Cype"},{"$f":"IF(Mat_DB!O34=\"\",\"---\",Mat_DB!O34)","v":1},{"$f":"IF(Mat_DB!P34=\"\",\"---\",Mat_DB!P34)","v":"m²/m²"},{"$f":"IF(Mat_DB!Q34=\"\",\"---\",Mat_DB!Q34)","v":46.400000000000006},"€/m²",{"$f":"Mat_DB!T34","v":0.156},"kg SB-eq/m²",{"$f":"Mat_DB!U34","v":238.56},"MJ/m²",{"$f":"Mat_DB!V34","v":4.5360000000000004E-2},"kg SO2-eq/m²",{"$f":"Mat_DB!W34","v":5.1599999999999997E-3},"kg (PO4)3-eq/m²",{"$f":"Mat_DB!X34","v":5.5199999999999997E-3},"kg C2H4-eq/m²",{"$f":"Mat_DB!Y34","v":14.28},"kg CO2-eq/m²",{"$f":"Mat_DB!Z34","v":1.567608E-6},"kg CFC11-eq/m²",{"$f":"Mat_DB!AC34","v":"---"},"mm",{"$f":"Mat_DB!AD34","v":"---"},"mm",{"$f":"Mat_DB!AE34","v":"---"},"mm",1,1,3,2,null,10,1,1,1,0,0,0,0,"---","---",null,null,null,null,"Almodôvar",27,null,"Pinhal Litoral",18,126,1323,1900,20.100000000000001,-2,null,23,{"$f":"Loc_DB!G34","v":0},{"$f":"Loc_DB!J34","v":0},{"$f":"Loc_DB!N34","v":0},null,null,null,"Building Features 1",null,null,null,null,null,"Building Features 2",null,null,null,null,null,"Location",null,null,null,"Wall Composition",null,null,null,null,null,null,null,null,null,null,null,null,null,null,null,null,null,null,null,null,null,null,null,null,null,null,null,"e","lambda 1","lambda 1'","lambda 2","lambda 2'","r 1","r 2","R1","R2","Ref. 1","Ref. 2","W-Met-1","W-Met-2","W-Met-1","Sum","W-TB","Rsi",0.13,null,0.13,null,null,0.13,null,null,{"$f":"ED31","v":0.13},null,{"$f":"EF31","v":0.13},null,null,{"$f":"EI31","v":0.13},null,null,{"$f":"ED31","v":0.13},null,{"$f":"EF31","v":0.13},null,null,{"$f":"EI31","v":0.13},null,null,{"$f":"ED31","v":0.13},null,{"$f":"EF31","v":0.13},null,null,{"$f":"EI31","v":0.13},null,null,null,0.13,null,null,null,0.13,null,null,null,null,null,null,null,null,null,null,null,null,"OTHERS",null,null,null,null,null,null,null,null,null,null,null,null,null,null,null,null,"LAYER 9",null,"---",null,null,"---",null,null,"---",null,null,"---",null,null,"kg SB-eq",null,null,"---",null,null,"MJ",null,null,"---",null,null,"kg SO2-eq",null,null,"---",null,null,"kg (PO4)3-eq",null,null,"---",null,null,"kg C2H4-eq",null,null,"---",null,null,"kg CO2-eq",null,null,"---",null,null,"kg CFC11-eq",null,null,null,null,null,"LAYER 4",null,"Mineral wool (90 mm) [Volcalis]",null,null,2.9160000000000004,null,null,"€/m²",null,null,{"$f":"IF(VLOOKUP(CO37,$C$9:$AV$61,36)=7,1,VLOOKUP(CO37,$C$9:$AV$61,10))","v":1},null,null,"m²/m²",null,null,"Steel C90/U93 (90 mm) [Pertecno]",null,null,{"$f":"VLOOKUP(CX37,$C$9:$AV$61,12)","v":6.2348200000000009},null,null,"€/m",null,null,{"$f":"IF(VLOOKUP(CX37,$C$9:$AV$61,36)=1,$AT$17,IF(VLOOKUP(CX37,$C$9:$AV$61,36)=6,$AT$17,VLOOKUP(CX37,$C$9:$AV$61,10)))","v":3.3074074074074078},null,null,"m/m²",null,null,2.9160000000000004,null,null,20.621089851851856,null,null,null,null,null,null,null,null,null,null,null,"AP",null,{"$f":"HP33+0.00000001","v":4.8051774120000008E-2},{"$f":"HP60+0.00000001","v":5.4169421178823542E-2},4.8051774120000008E-2,5.4169421178823542E-2,0.14000000000000001,1,0.88706456658216781,null,1,2,4,8,8,null,"-","--",12]
[null,null,24,{"$f":"Mat_DB!D35","v":"ETICS EPS (150 mm) [Weber]"},{"$f":"Mat_DB!H35","v":"External Insulation"},{"$f":"Mat_DB!J35","v":150},{"$f":"Mat_DB!L35","v":"R [(m²·K)/W]"},{"$f":"Mat_DB!K35","v":4.3125},"---",4.3125,{"$f":"Mat_DB!M35","v":"Cype"},{"$f":"IF(Mat_DB!O35=\"\",\"---\",Mat_DB!O35)","v":1},{"$f":"IF(Mat_DB!P35=\"\",\"---\",Mat_DB!P35)","v":"m²/m²"},{"$f":"IF(Mat_DB!Q35=\"\",\"---\",Mat_DB!Q35)","v":50.975000000000001},"€/m²",{"$f":"Mat_DB!T35","v":0.19500000000000001},"kg SB-eq/m²",{"$f":"Mat_DB!U35","v":298.20000000000005},"MJ/m²",{"$f":"Mat_DB!V35","v":5.6700000000000014E-2},"kg SO2-eq/m²",{"$f":"Mat_DB!W35","v":6.45E-3},"kg (PO4)3-eq/m²",{"$f":"Mat_DB!X35","v":6.8999999999999999E-3},"kg C2H4-eq/m²",{"$f":"Mat_DB!Y35","v":17.850000000000001},"kg CO2-eq/m²",{"$f":"Mat_DB!Z35","v":1.9595100000000003E-6},"kg CFC11-eq/m²",{"$f":"Mat_DB!AC35","v":"---"},"mm",{"$f":"Mat_DB!AD35","v":"---"},"mm",{"$f":"Mat_DB!AE35","v":"---"},"mm",1,1,3,2,null,null,{"$f":"SUM(AP22:AP31)","v":10},{"$f":"SUM(AQ22:AQ31)","v":10},{"$f":"SUM(AR22:AR31)","v":10},{"$f":"SUM(AS22:AS31)","v":0},{"$f":"IF(AS32=5,0.11,IF(AS32=10,0.15,IF(AS32>=25,0.18,IF(AS32<5,0.11*(AS32/5),IF(AS32<10,0.11+((AS32-5)/5)*0.04,IF(AS32<15,0.15+((AS32-10)/5)*0.02,IF(AS32<25,0.17+((AS32-15)/10)*0.01,0)))))))","v":0},null,null,null,null,null,null,null,null,"Alpiarça",21,null,"Oeste",19,99,1165,2200,21,0,null,24,{"$f":"Loc_DB!G35","v":0},{"$f":"Loc_DB!J35","v":0},{"$f":"Loc_DB!N35","v":0},null,null,null,null,null,null,null,null,null,null,null,null,null,null,null,null,null,null,null,null,null,null,null,null,null,null,null,null,null,null,null,null,null,null,null,null,null,null,null,null,null,null,null,null,null,"LAYER 1",null,{"$f":"VLOOKUP(CO14,$C$9:$AV$61,4)","v":12.5},{"$f":"VLOOKUP(CO14,$C$9:$AV$61,7)","v":0.17499999999999999},{"$f":"DM32*0.001/DR32","v":0.17499999999999999},{"$f":"VLOOKUP(CX14,$C$9:$AV$61,7)","v":"---"},{"$f":"DM32*0.001/DS32","v":{"$error":"#VALUE!"}},{"$f":"DT32","v":7.1428571428571438E-2},{"$f":"IF(VLOOKUP(CX14,$C$9:$AV$61,35)=2,(DM32*0.001)/DP32,VLOOKUP(CX14,$C$9:$AV$61,8))","v":"---"},{"$f":"AX22","v":7.1428571428571438E-2},{"$f":"IF(VLOOKUP(CX14,$C$9:$AV$61,34)=0,DT32,DS32)","v":7.1428571428571438E-2},{"$f":"VLOOKUP(CO14,$C$9:$AV$61,9)","v":"Gyptec"},{"$f":"VLOOKUP(CX14,$C$9:$AV$61,9)","v":"---"},{"$f":"1/($DS$12/($DM$13/DQ32)+$DS$13/($DM$13/DO32))","v":{"$error":"#VALUE!"}},{"$f":"1/($DS$14/(($DM$12-2*$DM$13)/DQ32)+$DS$15/(($DM$12-2*$DM$13)/DO32))","v":{"$error":"#VALUE!"}},{"$f":"1/($DS$12/($DM$13/DQ32)+$DS$13/($DM$13/DO32))","v":{"$error":"#VALUE!"}},{"$f":"DX32+DY32+DZ32","v":{"$error":"#VALUE!"}},{"$f":"1/($DS$18/DU32+$DS$19/DT32)","v":7.1428571428571438E-2},null,{"$f":"DT32","v":7.1428571428571438E-2},null,{"$f":"DU32","v":7.1428571428571438E-2},null,null,{"$f":"IF(VLOOKUP(CX14,$C$9:$AV$61,36)=1,1/(($DS$21/ED32)+($DS$20/EF32)),IF(VLOOKUP(CX14,$C$9:$AV$61,36)=6,1/(($DS$23/ED32)+($DS$22/EF32)),ED32))","v":7.1428571428571438E-2},null,null,7.1428571428571438E-2,null,7.1428571428571438E-2,null,null,7.1428571428571438E-2,null,null,7.1428571428571438E-2,null,7.1428571428571438E-2,null,null,7.1428571428571438E-2,null,null,7.1428571428571438E-2,null,7.1428571428571438E-2,null,null,7.1428571428571438E-2,null,null,null,{"$f":"ED32","v":7.1428571428571438E-2},null,null,null,{"$f":"IF(VLOOKUP(CX14,$C$9:$AV$61,36)=1,EA32,IF(VLOOKUP(CX14,$C$9:$AV$61,36)=6,EB32,FK32))","v":7.1428571428571438E-2},null,null,null,null,null,null,null,null,null,null,null,null,null,null,null,null,null,null,null,null,null,null,null,null,null,null,null,null,null,"LAYER 10",null,"---",null,null,"---",null,null,"---",null,null,"---",null,null,"kg SB-eq",null,null,"---",null,null,"MJ",null,null,"---",null,null,"kg SO2-eq",null,null,"---",null,null,"kg (PO4)3-eq",null,null,"---",null,null,"kg C2H4-eq",null,null,"---",null,null,"kg CO2-eq",null,null,"---",null,null,"kg CFC11-eq",null,null,null,null,null,"LAYER 5",null,"Air Cavity (10 mm) [ISO 6946]",null,null,0,null,null,"€/m²",null,null,1,null,null,"m²/m²",null,null,"TB Strip XPS (10 mm) [IFoam]",null,null,0.09,null,null,"€/m²",null,null,{"$f":"IF(VLOOKUP(CX38,$C$9:$AV$61,36)=1,$AT$17,IF(VLOOKUP(CX38,$C$9:$AV$61,36)=6,$AT$17,VLOOKUP(CX38,$C$9:$AV$61,10)))","v":3.3074074074074078},null,null,"m²/m²",null,null,0,null,null,0.29766666666666669,null,null,null,null,null,null,null,null,null,null,null,"EP",null,{"$f":"HV33+0.00000001","v":9.2275116940000023E-3},{"$f":"HV60+0.00000001","v":1.0021629341058826E-2},9.2275116940000023E-3,1.0021629341058826E-2,0.14000000000000001,1,0.92075962699944336,null,5,2,4,8,40,null,"+","-",24]
[null,null,25,{"$f":"Mat_DB!D36","v":"Steel C90/U93 (90 mm) [Pertecno]"},{"$f":"Mat_DB!H36","v":"LSF Structure (Studs/Tracks)"},{"$f":"Mat_DB!J36","v":90},{"$f":"Mat_DB!L36","v":"λ [W/(m·K)]"},{"$f":"Mat_DB!K36","v":50},50,"---",{"$f":"Mat_DB!M36","v":"Pertecno"},{"$f":"IF(Mat_DB!O36=\"\",\"---\",Mat_DB!O36)","v":"---"},{"$f":"IF(Mat_DB!P36=\"\",\"---\",Mat_DB!P36)","v":"m/m²"},{"$f":"IF(Mat_DB!Q36=\"\",\"---\",Mat_DB!Q36)","v":6.2348200000000009},"€/m",{"$f":"Mat_DB!T36","v":1.3118837600000001E-7},"kg SB-eq/m",{"$f":"Mat_DB!U36","v":72.901300000000006},"MJ/m",{"$f":"Mat_DB!V36","v":2.5764120000000004E-5},"kg SO2-eq/m",{"$f":"Mat_DB!W36","v":1.501694E-6},"kg (PO4)3-eq/m",{"$f":"Mat_DB!X36","v":4.6603460000000003E-4},"kg C2H4-eq/m",{"$f":"Mat_DB!Y36","v":5.5312800000000013E-3},"kg CO2-eq/m",{"$f":"Mat_DB!Z36","v":0},"kg CFC11-eq/m",{"$f":"Mat_DB!AC36","v":43},"mm",{"$f":"Mat_DB!AD36","v":90},"mm",{"$f":"Mat_DB!AE36","v":1.5},"mm",1,2,1,1,null,null,null,null,null,null,null,null,null,null,null,null,null,null,null,"Alter do Chão",24,null,"Médio Tejo",20,168,1330,1300,22.1,-7,null,25,{"$f":"Loc_DB!G36","v":0},{"$f":"Loc_DB!J36","v":0},{"$f":"Loc_DB!N36","v":0},null,null,null,"COUNTRY",null,{"$f":"SB_Inp1!C16","v":"1 - Portugal"},null,{"$f":"IF(BW33=DE67,1,2)","v":1},null,"COP",null,{"$f":"SB_Inp1!P20","v":3.5},null,null,null,"Portugal",null,{"$f":"IF(BY33=1,\"1 - Portugal [ENABLED]\", \"1 - Portugal [DISABLED]\")","v":"1 - Portugal [ENABLED]"},null,"LAYERS",null,"Material 1",null,null,"Lambda",null,null,"R",null,null,"Material 2",null,null,"Lambda",null,null,"R",null,null,"e",null,null,null,null,null,"LAYER 2",null,12,0.13,0.13,"---",{"$error":"#VALUE!"},9.2307692307692313E-2,"---",9.2307692307692313E-2,9.2307692307692313E-2,"Kronospan","---",{"$f":"1/($DS$12/($DM$13/DQ33)+$DS$13/($DM$13/DO33))","v":{"$error":"#VALUE!"}},{"$error":"#VALUE!"},{"$error":"#VALUE!"},{"$error":"#VALUE!"},9.2307692307692313E-2,null,9.2307692307692313E-2,null,9.2307692307692313E-2,null,null,{"$f":"IF(VLOOKUP(CX15,$C$9:$AV$61,36)=1,1/(($DS$21/ED33)+($DS$20/EF33)),IF(VLOOKUP(CX15,$C$9:$AV$61,36)=6,1/(($DS$23/ED33)+($DS$22/EF33)),ED33))","v":9.2307692307692313E-2},null,null,9.2307692307692313E-2,null,9.2307692307692313E-2,null,null,9.2307692307692313E-2,null,null,9.2307692307692313E-2,null,9.2307692307692313E-2,null,null,9.2307692307692313E-2,null,null,9.2307692307692313E-2,null,9.2307692307692313E-2,null,null,9.2307692307692313E-2,null,null,null,9.2307692307692313E-2,null,null,null,9.2307692307692313E-2,null,null,null,null,null,null,null,null,null,null,null,null,null,null,"SOLUTION A",null,null,"SOLUTION B",null,null,null,null,null,null,null,null,null,null,null,null,null,null,null,null,null,null,null,null,null,null,{"$f":"SUM(HD12:HF21)+SUM(HD23:HF32)","v":1.0659118837599999E-4},null,null,null,null,null,{"$f":"SUM(HJ12:HL21)+SUM(HJ23:HL32)","v":216.16129999999998},null,null,null,null,null,{"$f":"SUM(HP12:HR21)+SUM(HP23:HR32)","v":4.8051764120000007E-2},null,null,null,null,null,{"$f":"SUM(HV12:HX21)+SUM(HV23:HX32)","v":9.2275016940000024E-3},null,null,null,null,null,{"$f":"SUM(IB12:ID21)+SUM(IB23:ID32)","v":1.4825234600000001E-2},null,null,null,null,null,{"$f":"SUM(IH12:IJ21)+SUM(IH23:IJ32)","v":-12.625468719999999},null,null,null,null,null,{"$f":"SUM(IN12:IP21)+SUM(IN23:IP32)","v":1.576181932E-7},null,null,null,null,null,null,null,null,"LAYER 6",null,"OSB (12 mm) [Kronospan]",null,null,7.32,null,null,"€/m²",null,null,1,null,null,"m²/m²",null,null,"---",null,null,"---",null,null,"---",null,null,"---",null,null,"---",null,null,7.32,null,null,0,null,null,null,null,null,null,null,null,null,null,null,"POCP",null,1.0000000000000001E-5,1.0000000000000001E-5,10,10,0.14000000000000001,1,1,null,1,1,3,3,3,null,"-","+",4]
[null,null,26,{"$f":"Mat_DB!D37","v":"Steel C150/U153 (150 mm) [Pertecno]"},{"$f":"Mat_DB!H37","v":"LSF Structure (Studs/Tracks)"},{"$f":"Mat_DB!J37","v":150},{"$f":"Mat_DB!L37","v":"λ [W/(m·K)]"},{"$f":"Mat_DB!K37","v":50},50,"---",{"$f":"Mat_DB!M37","v":"Pertecno"},{"$f":"IF(Mat_DB!O37=\"\",\"---\",Mat_DB!O37)","v":"---"},{"$f":"IF(Mat_DB!P37=\"\",\"---\",Mat_DB!P37)","v":"m/m²"},{"$f":"IF(Mat_DB!Q37=\"\",\"---\",Mat_DB!Q37)","v":8.0492400000000011},"€/m",{"$f":"Mat_DB!T37","v":1.6936603199999999E-7},"kg SB-eq/m",{"$f":"Mat_DB!U37","v":94.116600000000005},"MJ/m",{"$f":"Mat_DB!V37","v":3.3261840000000003E-5},"kg SO2-eq/m",{"$f":"Mat_DB!W37","v":1.938708E-6},"kg (PO4)3-eq/m",{"$f":"Mat_DB!X37","v":6.0165719999999998E-4},"kg C2H4-eq/m",{"$f":"Mat_DB!Y37","v":7.1409600000000009E-3},"kg CO2-eq/m",{"$f":"Mat_DB!Z37","v":0},"kg CFC11-eq/m",{"$f":"Mat_DB!AC37","v":43},"mm",{"$f":"Mat_DB!AD37","v":150},"mm",{"$f":"Mat_DB!AE37","v":1.5},"mm",1,2,1,1,null,null,null,null,null,null,null,null,null,null,null,null,null,null,null,"Alvaiázere",16,null,"Lezíria do Tejo",21,73,1135,2700,23.1,-6,null,26,{"$f":"Loc_DB!G37","v":0},{"$f":"Loc_DB!J37","v":0},{"$f":"Loc_DB!N37","v":0},null,null,null,"PORTUGAL",null,{"$f":"SB_Inp1!H16","v":"Coimbra"},null,null,null,"EER",null,{"$f":"SB_Inp1!P21","v":3.5},null,null,null,"Other Locations",null,{"$f":"IF(BY33=2,\"2 - Other Locations [ENABLED]\", \"2 - Other Locations [DISABLED]\")","v":"2 - Other Locations [DISABLED]"},null,"LAYER 1",null,{"$f":"SB_Inp2!D17","v":"Gypsum Board (12,5 mm) [Gyptec]"},null,{"$f":"IF(CM34=$D$9,1,IF(CM34=$D$10,2,IF(CM34=$D$11,3,IF(CM34=$D$12,4,IF(CM34=$D$13,5,IF(CM34=$D$14,6,IF(CM34=$D$15,7,IF(CM34=$D$16,8,IF(CM34=$D$17,9,IF(CM34=$D$18,10,IF(CM34=$D$19,11,IF(CM34=$D$20,12,IF(CM34=$D$21,13,IF(CM34=$D$22,14,IF(CM34=$D$23,15,IF(CM34=$D$24,16,IF(CM34=$D$25,17,IF(CM34=$D$26,18,IF(CM34=$D$27,19,IF(CM34=$D$28,20,IF(CM34=$D$29,21,IF(CM34=$D$30,22,IF(CM34=$D$31,23,IF(CM34=$D$32,24,IF(CM34=$D$33,25,IF(CM34=$D$34,26,IF(CM34=$D$35,27,IF(CM34=$D$36,28,IF(CM34=$D$37,29,IF(CM34=$D$38,30,IF(CM34=$D$39,31,IF(CM34=$D$40,32,IF(CM34=$D$41,33,IF(CM34=$D$42,34,IF(CM34=$D$43,35,IF(CM34=$D$44,36,IF(CM34=$D$45,37,IF(CM34=$D$46,38,IF(CM34=$D$47,39,IF(CM34=$D$48,40,IF(CM34=$D$49,41,IF(CM34=$D$50,42,IF(CM34=$D$51,43,IF(CM34=$D$52,44,IF(CM34=$D$53,45,IF(CM34=$D$54,46,IF(CM34=$D$55,47,IF(CM34=$D$56,48,IF(CM34=$D$57,49,IF(CM34=$D$58,50,0))))))))))))))))))))))))))))))))))))))))))))))))))","v":4},{"$f":"DN77","v":0.17499999999999999},null,null,{"$f":"DR77","v":7.1428571428571438E-2},null,null,{"$f":"SB_Inp2!I17","v":"---"},null,{"$f":"IF(CV34=$D$9,1,IF(CV34=$D$10,2,IF(CV34=$D$11,3,IF(CV34=$D$12,4,IF(CV34=$D$13,5,IF(CV34=$D$14,6,IF(CV34=$D$15,7,IF(CV34=$D$16,8,IF(CV34=$D$17,9,IF(CV34=$D$18,10,IF(CV34=$D$19,11,IF(CV34=$D$20,12,IF(CV34=$D$21,13,IF(CV34=$D$22,14,IF(CV34=$D$23,15,IF(CV34=$D$24,16,IF(CV34=$D$25,17,IF(CV34=$D$26,18,IF(CV34=$D$27,19,IF(CV34=$D$28,20,IF(CV34=$D$29,21,IF(CV34=$D$30,22,IF(CV34=$D$31,23,IF(CV34=$D$32,24,IF(CV34=$D$33,25,IF(CV34=$D$34,26,IF(CV34=$D$35,27,IF(CV34=$D$36,28,IF(CV34=$D$37,29,IF(CV34=$D$38,30,IF(CV34=$D$39,31,IF(CV34=$D$40,32,IF(CV34=$D$41,33,IF(CV34=$D$42,34,IF(CV34=$D$43,35,IF(CV34=$D$44,36,IF(CV34=$D$45,37,IF(CV34=$D$46,38,IF(CV34=$D$47,39,IF(CV34=$D$48,40,IF(CV34=$D$49,41,IF(CV34=$D$50,42,IF(CV34=$D$51,43,IF(CV34=$D$52,44,IF(CV34=$D$53,45,IF(CV34=$D$54,46,IF(CV34=$D$55,47,IF(CV34=$D$56,48,IF(CV34=$D$56,49,IF(CV34=$D$57,50,0))))))))))))))))))))))))))))))))))))))))))))))))))","v":1},{"$f":"DP77","v":"---"},null,null,{"$f":"DS77","v":"---"},null,null,{"$f":"DM77","v":12.5},null,null,null,null,null,"LAYER 3",null,90,3.5000000000000003E-2,3.5000000000000003E-2,50,50,2.5714285714285712,1.8E-3,2.5714285714285712,1.8E-3,"Volcalis","Pertecno",{"$f":"1/($DS$12/($DM$13/DQ34)+$DS$13/($DM$13/DO34))","v":6.4134887752327792E-5},0.10239549684971375,{"$f":"1/($DS$12/($DM$13/DQ34)+$DS$13/($DM$13/DO34))","v":6.4134887752327792E-5},0.10252376662521839,2.5714285714285712,null,2.5714285714285712,null,1.8E-3,null,null,{"$f":"IF(VLOOKUP(CX16,$C$9:$AV$61,36)=1,1/(($DS$21/ED34)+($DS$20/EF34)),IF(VLOOKUP(CX16,$C$9:$AV$61,36)=6,1/(($DS$23/ED34)+($DS$22/EF34)),ED34))","v":0.4047331290930043},null,null,2.5714285714285712,null,1.8E-3,null,null,0.4047331290930043,null,null,2.5714285714285712,null,1.8E-3,null,null,0.4047331290930043,null,null,2.5714285714285712,null,1.8E-3,null,null,0.4047331290930043,null,null,null,2.5714285714285712,null,null,null,{"$f":"IF(VLOOKUP(CX16,$C$9:$AV$61,36)=1,EA34,IF(VLOOKUP(CX16,$C$9:$AV$61,36)=6,EB34,FK34))","v":0.10252376662521839},null,null,null,null,null,null,null,null,null,null,null,null,"L",null,{"$f":"BW16","v":"Helsinki_FI"},null,null,{"$f":"BW36","v":"Stockholm_SE"},null,null,null,null,null,null,null,null,null,null,null,null,null,null,null,null,null,null,null,null,null,null,null,null,null,null,null,null,null,null,null,null,null,null,null,null,null,null,null,null,null,null,null,null,null,null,null,null,null,null,null,null,null,null,null,null,null,null,null,null,null,null,null,null,null,null,null,"LAYER 7",null,"Mortar (10 mm)",null,null,2.44,null,null,"€/m²",null,null,1,null,null,"m²/m²",null,null,"---",null,null,"---",null,null,"---",null,null,"---",null,null,"---",null,null,2.44,null,null,0,null,null,null,null,null,null,null,null,null,null,null,"GWP",null,{"$f":"IH33+0.00000001","v":-12.625468709999998},{"$f":"IH60+0.00000001","v":-11.113704004117645},12.625468709999998,14.137233415882351,0.16,1,0.89306502471806304,null,1,2,4,8,8]
[null,null,27,{"$f":"Mat_DB!D38","v":"Steel C200/U204 (200 mm) [Pertecno]"},{"$f":"Mat_DB!H38","v":"LSF Structure (Studs/Tracks)"},{"$f":"Mat_DB!J38","v":200},{"$f":"Mat_DB!L38","v":"λ [W/(m·K)]"},{"$f":"Mat_DB!K38","v":50},50,"---",{"$f":"Mat_DB!M38","v":"Pertecno"},{"$f":"IF(Mat_DB!O38=\"\",\"---\",Mat_DB!O38)","v":"---"},{"$f":"IF(Mat_DB!P38=\"\",\"---\",Mat_DB!P38)","v":"m/m²"},{"$f":"IF(Mat_DB!Q38=\"\",\"---\",Mat_DB!Q38)","v":12.74977},"€/m",{"$f":"Mat_DB!T38","v":2.6827103600000001E-7},"kg SB-eq/m",{"$f":"Mat_DB!U38","v":149.07804999999999},"MJ/m",{"$f":"Mat_DB!V38","v":5.2685820000000004E-5},"kg SO2-eq/m",{"$f":"Mat_DB!W38","v":3.070859E-6},"kg (PO4)3-eq/m",{"$f":"Mat_DB!X38","v":9.5300810000000001E-4},"kg C2H4-eq/m",{"$f":"Mat_DB!Y38","v":1.1311080000000001E-2},"kg CO2-eq/m",{"$f":"Mat_DB!Z38","v":0},"kg CFC11-eq/m",{"$f":"Mat_DB!AC38","v":43},"mm",{"$f":"Mat_DB!AD38","v":200},"mm",{"$f":"Mat_DB!AE38","v":1.5},"mm",1,2,1,1,null,"AIR CAVITIES - B",null,null,null,null,null,null,null,null,null,null,null,null,null,"Alvito",27,null,"Grande Lisboa",22,109,1071,1700,21.7,-10,null,27,{"$f":"Loc_DB!G38","v":0},{"$f":"Loc_DB!J38","v":0},{"$f":"Loc_DB!N38","v":0},null,null,null,"ALTITUDE",null,{"$f":"SB_Inp1!H17","v":75},null,null,null,"ELECT. COST",null,{"$f":"SB_Inp1!P26","v":0.25},null,null,null,null,null,null,null,"LAYER 2",null,{"$f":"SB_Inp2!D18","v":"OSB (12 mm) [Kronospan]"},null,{"$f":"IF(CM35=$D$9,1,IF(CM35=$D$10,2,IF(CM35=$D$11,3,IF(CM35=$D$12,4,IF(CM35=$D$13,5,IF(CM35=$D$14,6,IF(CM35=$D$15,7,IF(CM35=$D$16,8,IF(CM35=$D$17,9,IF(CM35=$D$18,10,IF(CM35=$D$19,11,IF(CM35=$D$20,12,IF(CM35=$D$21,13,IF(CM35=$D$22,14,IF(CM35=$D$23,15,IF(CM35=$D$24,16,IF(CM35=$D$25,17,IF(CM35=$D$26,18,IF(CM35=$D$27,19,IF(CM35=$D$28,20,IF(CM35=$D$29,21,IF(CM35=$D$30,22,IF(CM35=$D$31,23,IF(CM35=$D$32,24,IF(CM35=$D$33,25,IF(CM35=$D$34,26,IF(CM35=$D$35,27,IF(CM35=$D$36,28,IF(CM35=$D$37,29,IF(CM35=$D$38,30,IF(CM35=$D$39,31,IF(CM35=$D$40,32,IF(CM35=$D$41,33,IF(CM35=$D$42,34,IF(CM35=$D$43,35,IF(CM35=$D$44,36,IF(CM35=$D$45,37,IF(CM35=$D$46,38,IF(CM35=$D$47,39,IF(CM35=$D$48,40,IF(CM35=$D$49,41,IF(CM35=$D$50,42,IF(CM35=$D$51,43,IF(CM35=$D$52,44,IF(CM35=$D$53,45,IF(CM35=$D$54,46,IF(CM35=$D$55,47,IF(CM35=$D$56,48,IF(CM35=$D$57,49,IF(CM35=$D$58,50,0))))))))))))))))))))))))))))))))))))))))))))))))))","v":8},0.13,null,null,9.2307692307692313E-2,null,null,{"$f":"SB_Inp2!I18","v":"---"},null,{"$f":"IF(CV35=$D$9,1,IF(CV35=$D$10,2,IF(CV35=$D$11,3,IF(CV35=$D$12,4,IF(CV35=$D$13,5,IF(CV35=$D$14,6,IF(CV35=$D$15,7,IF(CV35=$D$16,8,IF(CV35=$D$17,9,IF(CV35=$D$18,10,IF(CV35=$D$19,11,IF(CV35=$D$20,12,IF(CV35=$D$21,13,IF(CV35=$D$22,14,IF(CV35=$D$23,15,IF(CV35=$D$24,16,IF(CV35=$D$25,17,IF(CV35=$D$26,18,IF(CV35=$D$27,19,IF(CV35=$D$28,20,IF(CV35=$D$29,21,IF(CV35=$D$30,22,IF(CV35=$D$31,23,IF(CV35=$D$32,24,IF(CV35=$D$33,25,IF(CV35=$D$34,26,IF(CV35=$D$35,27,IF(CV35=$D$36,28,IF(CV35=$D$37,29,IF(CV35=$D$38,30,IF(CV35=$D$39,31,IF(CV35=$D$40,32,IF(CV35=$D$41,33,IF(CV35=$D$42,34,IF(CV35=$D$43,35,IF(CV35=$D$44,36,IF(CV35=$D$45,37,IF(CV35=$D$46,38,IF(CV35=$D$47,39,IF(CV35=$D$48,40,IF(CV35=$D$49,41,IF(CV35=$D$50,42,IF(CV35=$D$51,43,IF(CV35=$D$52,44,IF(CV35=$D$53,45,IF(CV35=$D$54,46,IF(CV35=$D$55,47,IF(CV35=$D$56,48,IF(CV35=$D$56,49,IF(CV35=$D$57,50,0))))))))))))))))))))))))))))))))))))))))))))))))))","v":1},"---",null,null,"---",null,null,12,null,null,null,null,null,"LAYER 4",null,12,0.13,0.13,"---",{"$error":"#VALUE!"},9.2307692307692313E-2,"---",9.2307692307692313E-2,9.2307692307692313E-2,"Kronospan","---",{"$error":"#VALUE!"},{"$f":"1/($DS$14/(($DM$12-2*$DM$13)/DQ35)+$DS$15/(($DM$12-2*$DM$13)/DO35))","v":{"$error":"#VALUE!"}},{"$f":"1/($DS$12/($DM$13/DQ35)+$DS$13/($DM$13/DO35))","v":{"$error":"#VALUE!"}},{"$error":"#VALUE!"},9.2307692307692313E-2,null,9.2307692307692313E-2,null,9.2307692307692313E-2,null,null,9.2307692307692313E-2,null,null,9.2307692307692313E-2,null,9.2307692307692313E-2,null,null,9.2307692307692313E-2,null,null,9.2307692307692313E-2,null,9.2307692307692313E-2,null,null,9.2307692307692313E-2,null,null,9.2307692307692313E-2,null,9.2307692307692313E-2,null,null,9.2307692307692313E-2,null,null,null,9.2307692307692313E-2,null,null,null,{"$f":"IF(VLOOKUP(CX17,$C$9:$AV$61,36)=1,EA35,IF(VLOOKUP(CX17,$C$9:$AV$61,36)=6,EB35,FK35))","v":9.2307692307692313E-2},null,null,null,null,null,null,null,null,null,null,null,null,"U",null,{"$f":"DY19","v":0.52993548533700119},null,null,{"$f":"DY64","v":0.45144597340390985},null,null,null,null,null,null,null,null,null,null,null,"INDICATORS VALUE B",null,null,null,null,null,null,null,null,null,null,null,null,null,null,null,null,null,null,null,null,null,null,null,null,null,null,null,null,null,null,null,null,null,null,null,null,null,null,null,null,null,null,null,null,null,null,null,null,null,null,null,null,null,null,null,"LAYER 8",null,"---",null,null,"---",null,null,"---",null,null,"---",null,null,"---",null,null,"---",null,null,"---",null,null,"---",null,null,"---",null,null,"---",null,null,0,null,null,0,null,null,null,null,null,null,null,null,null,null,null,"ODP",null,{"$f":"IN33+0.00000001","v":1.6761819320000001E-7},{"$f":"IN60+0.00000001","v":2.1773584025882356E-7},1.6761819320000001E-7,2.1773584025882356E-7,0.14000000000000001,1,0.76982362205850685]
[null,null,28,{"$f":"Mat_DB!D39","v":"Steel C250/U255 (250 mm) [Pertecno]"},{"$f":"Mat_DB!H39","v":"LSF Structure (Studs/Tracks)"},{"$f":"Mat_DB!J39","v":250},{"$f":"Mat_DB!L39","v":"λ [W/(m·K)]"},{"$f":"Mat_DB!K39","v":50},50,"---",{"$f":"Mat_DB!M39","v":"Pertecno"},{"$f":"IF(Mat_DB!O39=\"\",\"---\",Mat_DB!O39)","v":"---"},{"$f":"IF(Mat_DB!P39=\"\",\"---\",Mat_DB!P39)","v":"m/m²"},{"$f":"IF(Mat_DB!Q39=\"\",\"---\",Mat_DB!Q39)","v":18.46031},"€/m",{"$f":"Mat_DB!T39","v":3.8842790799999997E-7},"kg SB-eq/m",{"$f":"Mat_DB!U39","v":215.84915000000001},"MJ/m",{"$f":"Mat_DB!V39","v":7.6283460000000006E-5},"kg SO2-eq/m",{"$f":"Mat_DB!W39","v":4.4462769999999997E-6},"kg (PO4)3-eq/m",{"$f":"Mat_DB!X39","v":1.3798542999999999E-3},"kg C2H4-eq/m",{"$f":"Mat_DB!Y39","v":1.6377240000000001E-2},"kg CO2-eq/m",{"$f":"Mat_DB!Z39","v":0},"kg CFC11-eq/m",{"$f":"Mat_DB!AC39","v":43},"mm",{"$f":"Mat_DB!AD39","v":250},"mm",{"$f":"Mat_DB!AE39","v":1.5},"mm",1,2,1,1,null,null,null,null,null,null,null,null,null,null,null,null,null,null,null,"Amadora",22,null,"Península de Setúbal",23,47,1045,1500,22.8,-5,null,28,{"$f":"Loc_DB!G39","v":0},{"$f":"Loc_DB!J39","v":0},{"$f":"Loc_DB!N39","v":0},null,null,null,"OTHER",null,{"$f":"SB_Inp1!P16","v":"Stockholm_SE"},null,{"$f":"IF(BW36=$BO$9,1,IF(BW36=$BO$10,2,IF(BW36=$BO$11,3,IF(BW36=$BO$12,4,IF(BW36=$BO$13,5,IF(BW36=$BO$14,6,IF(BW36=$BO$15,7,IF(BW36=$BO$16,8,IF(BW36=$BO$17,9,IF(BW36=$BO$18,10,IF(BW36=$BO$19,11,IF(BW36=$BO$20,12,IF(BW36=$BO$21,13,IF(BW36=$BO$22,14,IF(BW36=$BO$23,15,IF(BW36=$BO$24,16,IF(BW36=$BO$25,17,IF(BW36=$BO$26,18,IF(BW36=$BO$27,19,IF(BW36=$BO$28,20,IF(BW36=$BO$29,21,IF(BW36=$BO$30,22,IF(BW36=$BO$31,23,IF(BW36=$BO$32,24,IF(BW36=$BO$33,25,IF(BW36=$BO$34,26,IF(BW36=$BO$35,27,IF(BW36=$BO$36,28,IF(BW36=$BO$37,29,IF(BW36=$BO$38,30,0))))))))))))))))))))))))))))))","v":6},null,null,null,null,null,null,null,null,null,null,null,"LAYER 3",null,{"$f":"SB_Inp2!D19","v":"Air Cavity (10 mm) [ISO 6946]"},null,34,"---",null,null,0.15,null,null,{"$f":"SB_Inp2!I19","v":"TB Strip XPS (10 mm) [IFoam]"},null,{"$f":"IF(CV36=$D$9,1,IF(CV36=$D$10,2,IF(CV36=$D$11,3,IF(CV36=$D$12,4,IF(CV36=$D$13,5,IF(CV36=$D$14,6,IF(CV36=$D$15,7,IF(CV36=$D$16,8,IF(CV36=$D$17,9,IF(CV36=$D$18,10,IF(CV36=$D$19,11,IF(CV36=$D$20,12,IF(CV36=$D$21,13,IF(CV36=$D$22,14,IF(CV36=$D$23,15,IF(CV36=$D$24,16,IF(CV36=$D$25,17,IF(CV36=$D$26,18,IF(CV36=$D$27,19,IF(CV36=$D$28,20,IF(CV36=$D$29,21,IF(CV36=$D$30,22,IF(CV36=$D$31,23,IF(CV36=$D$32,24,IF(CV36=$D$33,25,IF(CV36=$D$34,26,IF(CV36=$D$35,27,IF(CV36=$D$36,28,IF(CV36=$D$37,29,IF(CV36=$D$38,30,IF(CV36=$D$39,31,IF(CV36=$D$40,32,IF(CV36=$D$41,33,IF(CV36=$D$42,34,IF(CV36=$D$43,35,IF(CV36=$D$44,36,IF(CV36=$D$45,37,IF(CV36=$D$46,38,IF(CV36=$D$47,39,IF(CV36=$D$48,40,IF(CV36=$D$49,41,IF(CV36=$D$50,42,IF(CV36=$D$51,43,IF(CV36=$D$52,44,IF(CV36=$D$53,45,IF(CV36=$D$54,46,IF(CV36=$D$55,47,IF(CV36=$D$56,48,IF(CV36=$D$56,49,IF(CV36=$D$57,50,0))))))))))))))))))))))))))))))))))))))))))))))))))","v":33},3.5000000000000003E-2,null,null,0.2857142857142857,null,null,10,null,null,null,null,null,"LAYER 5",null,10,1.8,1.8,"---",{"$error":"#VALUE!"},5.5555555555555558E-3,"---",5.5555555555555558E-3,5.5555555555555558E-3,"ITE50","---",{"$error":"#VALUE!"},{"$f":"1/($DS$14/(($DM$12-2*$DM$13)/DQ36)+$DS$15/(($DM$12-2*$DM$13)/DO36))","v":{"$error":"#VALUE!"}},{"$error":"#VALUE!"},{"$error":"#VALUE!"},5.5555555555555558E-3,null,5.5555555555555558E-3,null,5.5555555555555558E-3,null,null,5.5555555555555558E-3,null,null,5.5555555555555558E-3,null,5.5555555555555558E-3,null,null,5.5555555555555558E-3,null,null,5.5555555555555558E-3,null,5.5555555555555558E-3,null,null,5.5555555555555558E-3,null,null,5.5555555555555558E-3,null,5.5555555555555558E-3,null,null,5.5555555555555558E-3,null,null,null,5.5555555555555558E-3,null,null,null,5.5555555555555558E-3,null,null,null,null,null,null,null,null,null,null,null,null,"A",null,{"$f":"(BW17*(100-BW21)*0.01+BW18*(100-BW22)*0.01+BW19*(100-BW23)*0.01+BW20*(100-BW24)*0.01)*BW25*BW26","v":239.76000000000005},null,null,{"$f":"(BW37*(100-BW41)*0.01+BW38*(100-BW42)*0.01+BW39*(100-BW43)*0.01+BW40*(100-BW44)*0.01)*BW45*BW46","v":239.76000000000005},null,null,null,null,null,null,null,null,null,null,null,null,null,null,null,null,null,null,null,null,null,null,null,null,null,null,null,null,null,null,null,null,null,null,null,null,null,null,null,null,null,null,null,null,null,null,null,null,null,null,null,null,null,null,null,null,null,null,null,null,null,null,null,null,null,null,null,"LAYER 9",null,"---",null,null,"---",null,null,"---",null,null,"---",null,null,"---",null,null,"---",null,null,"---",null,null,"---",null,null,"---",null,null,"---",null,null,0,null,null,0,null,null,null,null,null,null,null,null,null,null,null,null,null,null,null,null,null,null,{"$f":"KX29*KY29+KX30*KY30+KX31*KY31+KX32*KY32+KX33*KY33+KX34*KY34+KX35*KY35","v":1},{"$f":"KX29*KZ29+KX30*KZ30+KX31*KZ31+KX32*KZ32+KX33*KZ33+KX34*KZ34+KX35*KZ35","v":0.90429436191096935}]
[null,null,29,{"$f":"Mat_DB!D40","v":"TB Strip Aerogel (10 mm) [Spacetherm]"},{"$f":"Mat_DB!H40","v":"Thermal Break Strip"},{"$f":"Mat_DB!J40","v":10},{"$f":"Mat_DB!L40","v":"λ [W/(m·K)]"},{"$f":"Mat_DB!K40","v":1.4999999999999999E-2},1.4999999999999999E-2,"---",{"$f":"Mat_DB!M40","v":"Spacetherm"},{"$f":"IF(Mat_DB!O40=\"\",\"---\",Mat_DB!O40)","v":"---"},{"$f":"IF(Mat_DB!P40=\"\",\"---\",Mat_DB!P40)","v":"m/m²"},{"$f":"IF(Mat_DB!Q40=\"\",\"---\",Mat_DB!Q40)","v":3.86},"€/m",{"$f":"Mat_DB!T40","v":2.4449500000000002E-6},"kg SB-eq/m",{"$f":"Mat_DB!U40","v":4.5789499999999999},"MJ/m",{"$f":"Mat_DB!V40","v":3.0195E-3},"kg SO2-eq/m",{"$f":"Mat_DB!W40","v":3.1030000000000001E-4},"kg (PO4)3-eq/m",{"$f":"Mat_DB!X40","v":2.0785000000000001E-4},"kg C2H4-eq/m",{"$f":"Mat_DB!Y40","v":0.624},"kg CO2-eq/m",{"$f":"Mat_DB!Z40","v":1.7075000000000002E-7},"kg CFC11-eq/m",{"$f":"Mat_DB!AC40","v":"---"},"mm",{"$f":"Mat_DB!AD40","v":"---"},"mm",{"$f":"Mat_DB!AE40","v":"---"},"mm",1,2,6,1,null,"Layer","Material 1","Material 2","1x2","AC thickn.","R ISO6946","R AC","R1","R2","R Final",null,null,null,null,"Amarante",6,null,"Alto Alentejo",24,246,1221,1200,24.5,0,null,29,{"$f":"Loc_DB!G40","v":0},{"$f":"Loc_DB!J40","v":0},{"$f":"Loc_DB!N40","v":0},null,null,null,"MF",null,{"$f":"SB_Inp1!G20","v":15},null,null,null,"Wall Configuration 2",null,null,null,null,null,null,null,null,null,"LAYER 4",null,{"$f":"SB_Inp2!D20","v":"Mineral wool (90 mm) [Volcalis]"},null,15,3.5000000000000003E-2,null,null,2.5714285714285712,null,null,{"$f":"SB_Inp2!I20","v":"Steel C90/U93 (90 mm) [Pertecno]"},null,25,50,null,null,1.8E-3,null,null,90,null,null,null,null,null,"LAYER 6",null,"---","---",{"$error":"#VALUE!"},"---",{"$error":"#VALUE!"},"---","---","---","---","---","---",{"$error":"#VALUE!"},{"$error":"#VALUE!"},{"$error":"#VALUE!"},{"$error":"#VALUE!"},{"$error":"#VALUE!"},null,"---",null,"---",null,null,"---",null,null,"---",null,"---",null,null,"---",null,null,"---",null,"---",null,null,"---",null,null,"---",null,"---",null,null,"---",null,null,null,"---",null,null,null,"---",null,null,null,null,null,null,null,null,null,null,null,null,"HDD",null,{"$f":"VLOOKUP(BY16,$BN$9:$BQ$38,3)","v":4854},null,null,{"$f":"VLOOKUP(BY36,$BN$9:$BQ$38,3)","v":4351},null,null,null,null,null,null,null,null,null,null,null,null,null,null,null,null,null,null,null,null,null,null,null,null,null,null,null,null,null,null,null,null,null,null,null,null,null,null,null,null,null,null,null,null,null,null,null,null,null,null,null,null,null,null,null,null,null,null,null,null,null,null,null,null,null,null,null,"LAYER 10",null,"---",null,null,"---",null,null,"---",null,null,"---",null,null,"---",null,null,"---",null,null,"---",null,null,"---",null,null,"---",null,null,"---",null,null,0,null,null,0]
[null,null,30,{"$f":"Mat_DB!D41","v":"TB Strip Rubber (10 mm) [Acousticork]"},{"$f":"Mat_DB!H41","v":"Thermal Break Strip"},{"$f":"Mat_DB!J41","v":10},{"$f":"Mat_DB!L41","v":"λ [W/(m·K)]"},{"$f":"Mat_DB!K41","v":0.122},0.122,"---",{"$f":"Mat_DB!M41","v":"Acousticork"},{"$f":"IF(Mat_DB!O41=\"\",\"---\",Mat_DB!O41)","v":"---"},{"$f":"IF(Mat_DB!P41=\"\",\"---\",Mat_DB!P41)","v":"m/m²"},{"$f":"IF(Mat_DB!Q41=\"\",\"---\",Mat_DB!Q41)","v":0.77},"€/m",{"$f":"Mat_DB!T41","v":0},"kg SB-eq/m",{"$f":"Mat_DB!U41","v":0},"MJ/m",{"$f":"Mat_DB!V41","v":0},"kg SO2-eq/m",{"$f":"Mat_DB!W41","v":0},"kg (PO4)3-eq/m",{"$f":"Mat_DB!X41","v":0},"kg C2H4-eq/m",{"$f":"Mat_DB!Y41","v":0},"kg CO2-eq/m",{"$f":"Mat_DB!Z41","v":0},"kg CFC11-eq/m",{"$f":"Mat_DB!AC41","v":"---"},"mm",{"$f":"Mat_DB!AD41","v":"---"},"mm",{"$f":"Mat_DB!AE41","v":"---"},"mm",1,2,6,1,null,1,{"$f":"IF(VLOOKUP(CO34,$C$9:$AV$61,36)=7,2,1)","v":1},{"$f":"IF(VLOOKUP(CX34,$C$9:$AV$61,36)=6,2,1)","v":1},{"$f":"AP38*AQ38","v":1},{"$f":"IF(VLOOKUP(CO34,$C$9:$AV$61,36)=7,VLOOKUP(CO34,$C$9:$AV$61,4),0)","v":0},{"$f":"IF(AS38=5,0.11,IF(AS38=10,0.15,IF(AS38>=25,0.18,IF(AS38<5,0.11*(AS38/5),IF(AS38<10,0.11+((AS38-5)/5)*0.04,IF(AS38<15,0.15+((AS38-10)/5)*0.02,IF(AS38<25,0.17+((AS38-15)/10)*0.01,0)))))))","v":0},{"$f":"IF($AR$48=17,$AT$48*AS38/$AS$48,IF($AR$48=16,AT38,IF($AR$48=14,$AT$48*AS38/$AS$48,IF($AR$48=13,AT38,IF($AR$48=11,AT38,0)))))","v":0},{"$f":"IF(VLOOKUP(CO34,$C$9:$AV$61,36)=7,AU38,0)","v":0},{"$f":"IF(VLOOKUP(CO34,$C$9:$AV$61,35)=2,(DM77*0.001)/DN77,VLOOKUP(CO34,$C$9:$AV$61,8))","v":7.1428571428571438E-2},{"$f":"IF(VLOOKUP(CO34,$C$9:$AV$61,36)=7,AV38,AW38)","v":7.1428571428571438E-2},null,null,null,null,"Amares",3,null,"Alentejo Central",25,221,1150,1100,24.3,0,null,30,{"$f":"Loc_DB!G41","v":0},{"$f":"Loc_DB!J41","v":0},{"$f":"Loc_DB!N41","v":0},null,null,null,"BF",null,{"$f":"SB_Inp1!G21","v":15},null,null,null,null,null,null,null,null,null,null,null,null,null,"LAYER 5",null,{"$f":"SB_Inp2!D21","v":"Air Cavity (10 mm) [ISO 6946]"},null,34,"---",null,null,0.15,null,null,{"$f":"SB_Inp2!I21","v":"TB Strip XPS (10 mm) [IFoam]"},null,33,3.5000000000000003E-2,null,null,0.2857142857142857,null,null,10,null,null,null,null,null,"LAYER 7",null,"---","---",{"$error":"#VALUE!"},"---",{"$error":"#VALUE!"},"---","---","---","---","---","---",{"$error":"#VALUE!"},{"$error":"#VALUE!"},{"$error":"#VALUE!"},{"$error":"#VALUE!"},{"$error":"#VALUE!"},null,"---",null,"---",null,null,"---",null,null,"---",null,"---",null,null,"---",null,null,"---",null,"---",null,null,"---",null,null,"---",null,"---",null,null,"---",null,null,null,"---",null,null,null,"---",null,null,null,null,null,null,null,null,null,null,null,null,"CDD",null,{"$f":"VLOOKUP(BY16,$BN$9:$BQ$38,4)","v":4},null,null,{"$f":"VLOOKUP(BY36,$BN$9:$BQ$38,4)","v":3},null,null,null,null,null,null,null,null,null,null,null,"Layers",null,"Material 1",null,null,"Unit Consumption",null,null,null,null,null,"Indicator",null,null,null,null,null,"Indicator",null,null,null,null,null,"Indicator",null,null,null,null,null,"Indicator",null,null,null,null,null,"Indicator",null,null,null,null,null,"Indicator",null,null,null,null,null,"Indicator",null,null,null,null,null,null,null,null,null,null,null,null,null,null,null,null,null,null,null,null,null,null,null,null,null,null,null,null,null,null,null,null,null,null,null,null,null,null,null,null,null,null,null,null,null,null,null,null,null,null,null,null,null,null,null,null,1,2,3,4,null,1,2,3,4,"EVAL.","BEST"]
[null,null,31,{"$f":"Mat_DB!D42","v":"TB Strip Aerogel/Rubber (10 mm) [T4BI]"},{"$f":"Mat_DB!H42","v":"Thermal Break Strip"},{"$f":"Mat_DB!J42","v":10},{"$f":"Mat_DB!L42","v":"λ [W/(m·K)]"},{"$f":"Mat_DB!K42","v":2.3E-2},2.3E-2,"---",{"$f":"Mat_DB!M42","v":"Tyre4BuildIns"},{"$f":"IF(Mat_DB!O42=\"\",\"---\",Mat_DB!O42)","v":"---"},{"$f":"IF(Mat_DB!P42=\"\",\"---\",Mat_DB!P42)","v":"m/m²"},{"$f":"IF(Mat_DB!Q42=\"\",\"---\",Mat_DB!Q42)","v":110.82},"€/m",{"$f":"Mat_DB!T42","v":0},"kg SB-eq/m",{"$f":"Mat_DB!U42","v":0},"MJ/m",{"$f":"Mat_DB!V42","v":0},"kg SO2-eq/m",{"$f":"Mat_DB!W42","v":0},"kg (PO4)3-eq/m",{"$f":"Mat_DB!X42","v":0},"kg C2H4-eq/m",{"$f":"Mat_DB!Y42","v":0},"kg CO2-eq/m",{"$f":"Mat_DB!Z42","v":0},"kg CFC11-eq/m",{"$f":"Mat_DB!AC42","v":"---"},"mm",{"$f":"Mat_DB!AD42","v":"---"},"mm",{"$f":"Mat_DB!AE42","v":"---"},"mm",1,2,6,1,null,2,{"$f":"IF(VLOOKUP(CO35,$C$9:$AV$61,36)=7,2,1)","v":1},{"$f":"IF(VLOOKUP(CX35,$C$9:$AV$61,36)=6,2,1)","v":1},{"$f":"AP39*AQ39","v":1},{"$f":"IF(VLOOKUP(CO35,$C$9:$AV$61,36)=7,VLOOKUP(CO35,$C$9:$AV$61,4),0)","v":0},{"$f":"IF(AS39=5,0.11,IF(AS39=10,0.15,IF(AS39>=25,0.18,IF(AS39<5,0.11*(AS39/5),IF(AS39<10,0.11+((AS39-5)/5)*0.04,IF(AS39<15,0.15+((AS39-10)/5)*0.02,IF(AS39<25,0.17+((AS39-15)/10)*0.01,0)))))))","v":0},{"$f":"IF($AR$48=17,$AT$48*AS39/$AS$48,IF($AR$48=16,AT39,IF($AR$48=14,$AT$48*AS39/$AS$48,IF($AR$48=13,AT39,IF($AR$48=11,AT39,0)))))","v":0},0,9.2307692307692313E-2,9.2307692307692313E-2,null,null,null,null,"Anadia",9,null,"Alentejo Litoral",26,88,1089,1100,22.2,0,null,null,null,null,null,null,null,null,"LF",null,{"$f":"SB_Inp1!G22","v":10},null,null,null,"SS",null,{"$f":"SB_Inp2!R15","v":400},null,null,null,null,null,null,null,"LAYER 6",null,{"$f":"SB_Inp2!D22","v":"OSB (12 mm) [Kronospan]"},null,8,0.13,null,null,9.2307692307692313E-2,null,null,{"$f":"SB_Inp2!I22","v":"---"},null,1,"---",null,null,"---",null,null,12,null,null,null,null,null,"LAYER 8",null,"---","---",{"$error":"#VALUE!"},"---",{"$error":"#VALUE!"},"---","---","---","---","---","---",{"$error":"#VALUE!"},{"$error":"#VALUE!"},{"$error":"#VALUE!"},{"$error":"#VALUE!"},{"$error":"#VALUE!"},null,"---",null,"---",null,null,"---",null,null,"---",null,"---",null,null,"---",null,null,"---",null,"---",null,null,"---",null,null,"---",null,"---",null,null,"---",null,null,null,"---",null,null,null,"---",null,null,null,null,null,null,null,null,null,null,null,null,"CoP",null,{"$f":"CC13","v":3.5},null,null,{"$f":"CC33","v":3.5},null,null,null,null,null,null,null,null,null,null,null,"LAYER 1",null,{"$f":"CM34","v":"Gypsum Board (12,5 mm) [Gyptec]"},null,null,{"$f":"IF(VLOOKUP(CO34,$C$9:$AV$61,36)=7,1,VLOOKUP(CO34,$C$9:$AV$61,10))","v":1},null,null,{"$f":"VLOOKUP(CO34,$C$9:$AV$61,11)","v":"m²/m²"},null,null,{"$f":"VLOOKUP(CO34,$C$9:$AV$61,14)","v":5.0999999999999999E-7},null,null,"kg SB-eq",null,null,{"$f":"VLOOKUP(CO34,$C$9:$AV$61,16)","v":0.35},null,null,"MJ",null,null,{"$f":"VLOOKUP(CO34,$C$9:$AV$61,18)","v":1.2E-2},null,null,"kg SO2-eq",null,null,{"$f":"VLOOKUP(CO34,$C$9:$AV$61,20)","v":1.1000000000000001E-3},null,null,"kg (PO4)3-eq",null,null,{"$f":"VLOOKUP(CO34,$C$9:$AV$61,22)","v":9.3999999999999997E-4},null,null,"kg C2H4-eq",null,null,{"$f":"VLOOKUP(CO34,$C$9:$AV$61,24)","v":2.5},null,null,"kg CO2-eq",null,null,{"$f":"VLOOKUP(CO34,$C$9:$AV$61,26)","v":6.1000000000000004E-8},null,null,"kg CFC11-eq",null,null,null,null,null,null,null,null,null,null,null,null,null,null,null,null,null,null,null,null,null,null,null,null,null,null,null,null,null,null,null,null,null,null,null,null,null,null,null,null,null,null,null,null,null,null,null,null,null,null,null,null,"A",{"$f":"DY19","v":0.52993548533700119},{"$f":"GD63","v":6.5852508790471793},{"$f":"KY36","v":1},{"$f":"KL12","v":43.867089851851858},"A",{"$f":"SMALL(KS$39:KS$40,1)/KS39","v":0.85188855227692928},0.85188855227692928,{"$f":"KU39","v":1},{"$f":"SMALL(KV$39:KV$40,1)/KV39","v":1},{"$f":"KX39*KT9+KY39*KT10+KZ39*KT11+LA39*KT12","v":0.94816099329692527},{"$f":"IF(LB39>LB40,\"A\",\"B\")","v":"B"}]
[null,null,32,{"$f":"Mat_DB!D43","v":"TB Strip Rubber and Cork (10 mm) [Acousticork]"},{"$f":"Mat_DB!H43","v":"Thermal Break Strip"},{"$f":"Mat_DB!J43","v":10},{"$f":"Mat_DB!L43","v":"λ [W/(m·K)]"},{"$f":"Mat_DB!K43","v":8.8999999999999996E-2},8.8999999999999996E-2,"---",{"$f":"Mat_DB!M43","v":"Acousticork"},{"$f":"IF(Mat_DB!O43=\"\",\"---\",Mat_DB!O43)","v":"---"},{"$f":"IF(Mat_DB!P43=\"\",\"---\",Mat_DB!P43)","v":"m/m²"},{"$f":"IF(Mat_DB!Q43=\"\",\"---\",Mat_DB!Q43)","v":1.92},"€/m",{"$f":"Mat_DB!T43","v":0},"kg SB-eq/m",{"$f":"Mat_DB!U43","v":0},"MJ/m",{"$f":"Mat_DB!V43","v":0},"kg SO2-eq/m",{"$f":"Mat_DB!W43","v":0},"kg (PO4)3-eq/m",{"$f":"Mat_DB!X43","v":0},"kg C2H4-eq/m",{"$f":"Mat_DB!Y43","v":0},"kg CO2-eq/m",{"$f":"Mat_DB!Z43","v":0},"kg CFC11-eq/m",{"$f":"Mat_DB!AC43","v":"---"},"mm",{"$f":"Mat_DB!AD43","v":"---"},"mm",{"$f":"Mat_DB!AE43","v":"---"},"mm",1,2,6,1,null,3,2,2,4,10,0.15,0.15,0.15,"---",0.15,null,null,null,null,"Angra do Heroísmo",29,null,"Baixo Alentejo",27,178,1068,1000,24.7,0,null,null,null,null,null,null,null,null,"RF",null,{"$f":"SB_Inp1!G23","v":10},null,null,null,"STR",null,{"$f":"IF(VLOOKUP(CX34,$C$9:$AV$61,36)=1,CV34,IF(VLOOKUP(CX35,$C$9:$AV$61,36)=1,CV35,IF(VLOOKUP(CX36,$C$9:$AV$61,36)=1,CV36,IF(VLOOKUP(CX37,$C$9:$AV$61,36)=1,CV37,IF(VLOOKUP(CX38,$C$9:$AV$61,36)=1,CV38,IF(VLOOKUP(CX39,$C$9:$AV$61,36)=1,CV39,IF(VLOOKUP(CX40,$C$9:$AV$61,36)=1,CV40,IF(VLOOKUP(CX41,$C$9:$AV$61,36)=1,CV41,IF(VLOOKUP(CX42,$C$9:$AV$61,36)=1,CV42,IF(VLOOKUP(CX43,$C$9:$AV$61,36)=1,CV43,\"---\"))))))))))","v":"Steel C90/U93 (90 mm) [Pertecno]"},null,{"$f":"IF(CC40=$D$9,1,IF(CC40=$D$10,2,IF(CC40=$D$11,3,IF(CC40=$D$12,4,IF(CC40=$D$13,5,IF(CC40=$D$14,6,IF(CC40=$D$15,7,IF(CC40=$D$16,8,IF(CC40=$D$17,9,IF(CC40=$D$18,10,IF(CC40=$D$19,11,IF(CC40=$D$20,12,IF(CC40=$D$21,13,IF(CC40=$D$22,14,IF(CC40=$D$23,15,IF(CC40=$D$24,16,IF(CC40=$D$25,17,IF(CC40=$D$26,18,IF(CC40=$D$27,19,IF(CC40=$D$28,20,IF(CC40=$D$29,21,IF(CC40=$D$30,22,IF(CC40=$D$31,23,IF(CC40=$D$32,24,IF(CC40=$D$33,25,IF(CC40=$D$34,26,IF(CC40=$D$35,27,IF(CC40=$D$36,28,IF(CC40=$D$37,29,IF(CC40=$D$38,30,IF(CC40=$D$39,31,IF(CC40=$D$40,32,IF(CC40=$D$41,33,IF(CC40=$D$42,34,IF(CC40=$D$43,35,IF(CC40=$D$44,36,IF(CC40=$D$45,37,IF(CC40=$D$46,38,IF(CC40=$D$47,39,IF(CC40=$D$48,40,IF(CC40=$D$49,41,IF(CC40=$D$50,42,IF(CC40=$D$51,43,IF(CC40=$D$52,44,IF(CC40=$D$53,45,IF(CC40=$D$54,46,IF(CC40=$D$55,47,IF(CC40=$D$56,48,IF(CC40=$D$57,49,IF(CC40=$D$58,50,0))))))))))))))))))))))))))))))))))))))))))))))))))","v":25},null,null,null,null,null,"LAYER 7",null,{"$f":"SB_Inp2!D23","v":"Mortar (10 mm)"},null,41,1.8,null,null,5.5555555555555558E-3,null,null,{"$f":"SB_Inp2!I23","v":"---"},null,1,"---",null,null,"---",null,null,10,null,null,null,null,null,"LAYER 9",null,"---","---",{"$error":"#VALUE!"},"---",{"$error":"#VALUE!"},"---","---","---","---","---","---",{"$error":"#VALUE!"},{"$error":"#VALUE!"},{"$error":"#VALUE!"},{"$error":"#VALUE!"},{"$error":"#VALUE!"},null,"---",null,"---",null,null,"---",null,null,"---",null,"---",null,null,"---",null,null,"---",null,"---",null,null,"---",null,null,"---",null,"---",null,null,"---",null,null,null,"---",null,null,null,"---",null,null,null,null,null,null,null,null,null,null,null,null,"EER",null,{"$f":"CC14","v":3.5},null,null,{"$f":"CC34","v":3.5},null,null,"DIFFERENCE",null,null,null,null,null,null,null,null,"LAYER 2",null,"OSB (12 mm) [Kronospan]",null,null,{"$f":"IF(VLOOKUP(CO35,$C$9:$AV$61,36)=7,1,VLOOKUP(CO35,$C$9:$AV$61,10))","v":1},null,null,"m²/m²",null,null,9.9000000000000005E-7,null,null,"kg SB-eq",null,null,51.36,null,null,"MJ",null,null,1.1028000000000001E-2,null,null,"kg SO2-eq",null,null,2.6280000000000001E-3,null,null,"kg (PO4)3-eq",null,null,6.2640000000000005E-3,null,null,"kg C2H4-eq",null,null,-9.0359999999999996,null,null,"kg CO2-eq",null,null,1.1315999999999999E-12,null,null,"kg CFC11-eq",null,null,null,null,null,null,null,null,null,null,null,null,null,null,null,null,null,null,null,null,null,null,null,null,null,null,null,null,null,null,null,null,null,null,null,null,null,null,null,null,null,null,null,null,null,null,null,null,null,null,null,null,"B",{"$f":"DY64","v":0.45144597340390985},{"$f":"GG63","v":5.6098998377318772},{"$f":"KZ36","v":0.90429436191096935},{"$f":"KL29","v":44.462423185185195},"B",1,1,{"$f":"KU40","v":0.90429436191096935},{"$f":"SMALL(KV$39:KV$40,1)/KV40","v":0.98661041637668323},{"$f":"KX40*KT9+KY40*KT10+KZ40*KT11+LA40*KT12","v":0.97894936247498698}]
[null,null,33,{"$f":"Mat_DB!D44","v":"TB Strip XPS (10 mm) [IFoam]"},{"$f":"Mat_DB!H44","v":"Thermal Break Strip"},{"$f":"Mat_DB!J44","v":10},{"$f":"Mat_DB!L44","v":"λ [W/(m·K)]"},{"$f":"Mat_DB!K44","v":3.5000000000000003E-2},3.5000000000000003E-2,"---",{"$f":"Mat_DB!M44","v":"IFoam"},{"$f":"IF(Mat_DB!O44=\"\",\"---\",Mat_DB!O44)","v":"---"},{"$f":"IF(Mat_DB!P44=\"\",\"---\",Mat_DB!P44)","v":"m²/m²"},{"$f":"IF(Mat_DB!Q44=\"\",\"---\",Mat_DB!Q44)","v":0.09},"€/m²",{"$f":"Mat_DB!T44","v":3.7647058823529416E-7},"kg SB-eq/m²",{"$f":"Mat_DB!U44","v":16.441176470588236},"MJ/m²",{"$f":"Mat_DB!V44","v":3.0588235294117649E-3},"kg SO2-eq/m²",{"$f":"Mat_DB!W44","v":3.9705882352941181E-4},"kg (PO4)3-eq/m²",{"$f":"Mat_DB!X44","v":1.8529411764705883E-4},"kg C2H4-eq/m²",{"$f":"Mat_DB!Y44","v":0.75588235294117645},"kg CO2-eq/m²",{"$f":"Mat_DB!Z44","v":2.5058823529411764E-8},"kg CFC11-eq/m²",{"$f":"Mat_DB!AC44","v":"---"},"mm",{"$f":"Mat_DB!AD44","v":"---"},"mm",{"$f":"Mat_DB!AE44","v":"---"},"mm",1,2,6,2,null,4,1,1,1,0,0,0,0,2.5714285714285712,2.5714285714285712,null,null,null,null,"Ansião",16,null,"Algarve",28,145,987,1800,23.1,0,null,null,null,null,null,null,null,null,"GL MF",null,{"$f":"SB_Inp1!K20","v":12},null,null,null,"SHT",null,{"$f":"SB_Inp2!R25","v":34.5},null,null,null,null,null,null,null,"LAYER 8",null,{"$f":"SB_Inp2!D24","v":"---"},null,1,"---",null,null,"---",null,null,{"$f":"SB_Inp2!I24","v":"---"},null,1,"---",null,null,"---",null,null,"---",null,null,null,null,null,"LAYER 10",null,"---","---",{"$error":"#VALUE!"},"---",{"$error":"#VALUE!"},"---","---","---","---","---","---",{"$error":"#VALUE!"},{"$error":"#VALUE!"},{"$error":"#VALUE!"},{"$error":"#VALUE!"},{"$error":"#VALUE!"},null,"---",null,"---",null,null,"---",null,null,"---",null,"---",null,null,"---",null,null,"---",null,"---",null,null,"---",null,null,"---",null,"---",null,null,"---",null,null,null,"---",null,null,null,"---",null,null,null,null,null,null,null,null,null,null,null,null,"HUFE",null,{"$f":"GD35*GD37*0.024/GD39","v":17.638675514234084},null,null,{"$f":"GG35*GG37*0.024/GG39","v":13.469084093351396},null,null,{"$f":"GD41-GG41","v":4.1695914208826874},null,null,null,null,null,null,null,null,"LAYER 3",null,"Air Cavity (10 mm) [ISO 6946]",null,null,{"$f":"IF(VLOOKUP(CO36,$C$9:$AV$61,36)=7,1,VLOOKUP(CO36,$C$9:$AV$61,10))","v":1},null,null,"m²/m²",null,null,0,null,null,"kg SB-eq",null,null,0,null,null,"MJ",null,null,0,null,null,"kg SO2-eq",null,null,0,null,null,"kg (PO4)3-eq",null,null,0,null,null,"kg C2H4-eq",null,null,0,null,null,"kg CO2-eq",null,null,0,null,null,"kg CFC11-eq",null,null,null,null,null,"FINAL RESULTS"]
[null,null,34,{"$f":"Mat_DB!D45","v":"Air Cavity (10 mm) [ISO 6946]"},{"$f":"Mat_DB!H45","v":"Air Cavity"},{"$f":"Mat_DB!J45","v":10},{"$f":"Mat_DB!L45","v":"R [(m²·K)/W]"},{"$f":"Mat_DB!K45","v":"---"},"---","---",{"$f":"Mat_DB!M45","v":"ISO 6946"},{"$f":"IF(Mat_DB!O45=\"\",\"---\",Mat_DB!O45)","v":"---"},{"$f":"IF(Mat_DB!P45=\"\",\"---\",Mat_DB!P45)","v":"m²/m²"},{"$f":"IF(Mat_DB!Q45=\"\",\"---\",Mat_DB!Q45)","v":0},"€/m²",{"$f":"Mat_DB!T45","v":0},"kg SB-eq/m²",{"$f":"Mat_DB!U45","v":0},"MJ/m²",{"$f":"Mat_DB!V45","v":0},"kg SO2-eq/m²",{"$f":"Mat_DB!W45","v":0},"kg (PO4)3-eq/m²",{"$f":"Mat_DB!X45","v":0},"kg C2H4-eq/m²",{"$f":"Mat_DB!Y45","v":0},"kg CO2-eq/m²",{"$f":"Mat_DB!Z45","v":0},"kg CFC11-eq/m²",{"$f":"Mat_DB!AC45","v":"---"},"mm",{"$f":"Mat_DB!AD45","v":"---"},"mm",{"$f":"Mat_DB!AE45","v":"---"},"mm",1,1,7,2,null,5,2,2,4,10,0.15,0.15,0.15,"---",0.15,null,null,null,null,"Arcos de Valdevez",1,null,"Região Autónoma dos Açores",29,10,604,1500,21.3,-6,null,null,null,null,null,null,null,null,"GL BF",null,{"$f":"SB_Inp1!K21","v":12},null,null,null,"TBW",null,{"$f":"SB_Inp2!R22","v":50},null,null,null,null,null,null,null,"LAYER 9",null,{"$f":"SB_Inp2!D25","v":"---"},null,1,"---",null,null,"---",null,null,{"$f":"SB_Inp2!I25","v":"---"},null,1,"---",null,null,"---",null,null,"---",null,null,null,null,null,null,null,null,null,null,null,null,null,null,null,null,null,null,null,null,null,null,null,"Rse",0.04,null,0.04,null,null,0.04,null,null,0.04,null,0.04,null,null,0.04,null,null,0.04,null,0.04,null,null,0.04,null,null,0.04,null,0.04,null,null,0.04,null,null,null,0.04,null,null,null,{"$f":"ED42","v":0.04},null,null,null,null,null,null,null,null,null,null,null,null,"HTFE",null,{"$f":"GD41*GD36","v":4229.0488412927643},null,null,{"$f":"GG41*GG36","v":3229.3476022219315},null,null,999.7012390708328,null,null,null,null,null,null,null,null,"LAYER 4",null,"Mineral wool (90 mm) [Volcalis]",null,null,1,null,null,"m²/m²",null,null,1.008E-4,null,null,"kg SB-eq",null,null,31.14,null,null,"MJ",null,null,9.0899999999999991E-3,null,null,"kg SO2-eq",null,null,1.872E-3,null,null,"kg (PO4)3-eq",null,null,6.4619999999999999E-4,null,null,"kg C2H4-eq",null,null,1.5209999999999999,null,null,"kg CO2-eq",null,null,1.5929999999999997E-11,null,null,"kg CFC11-eq"]
[null,null,35,{"$f":"Mat_DB!D46","v":"Air Cavity (15 mm) [ISO 6946]"},{"$f":"Mat_DB!H46","v":"Air Cavity"},{"$f":"Mat_DB!J46","v":15},{"$f":"Mat_DB!L46","v":"R [(m²·K)/W]"},{"$f":"Mat_DB!K46","v":"---"},"---","---",{"$f":"Mat_DB!M46","v":"ISO 6946"},{"$f":"IF(Mat_DB!O46=\"\",\"---\",Mat_DB!O46)","v":"---"},{"$f":"IF(Mat_DB!P46=\"\",\"---\",Mat_DB!P46)","v":"m²/m²"},{"$f":"IF(Mat_DB!Q46=\"\",\"---\",Mat_DB!Q46)","v":0},"€/m²",{"$f":"Mat_DB!T46","v":0},"kg SB-eq/m²",{"$f":"Mat_DB!U46","v":0},"MJ/m²",{"$f":"Mat_DB!V46","v":0},"kg SO2-eq/m²",{"$f":"Mat_DB!W46","v":0},"kg (PO4)3-eq/m²",{"$f":"Mat_DB!X46","v":0},"kg C2H4-eq/m²",{"$f":"Mat_DB!Y46","v":0},"kg CO2-eq/m²",{"$f":"Mat_DB!Z46","v":0},"kg CFC11-eq/m²",{"$f":"Mat_DB!AC46","v":"---"},"mm",{"$f":"Mat_DB!AD46","v":"---"},"mm",{"$f":"Mat_DB!AE46","v":"---"},"mm",1,1,7,2,null,6,1,1,1,0,0,0,0,9.2307692307692313E-2,9.2307692307692313E-2,null,null,null,null,"Arganil",16,null,"Região Autónoma da Madeira",30,380,618,1500,20.2,-6,null,null,null,null,null,null,null,null,"GL LF",null,{"$f":"SB_Inp1!K22","v":10},null,null,null,null,null,null,null,null,null,null,null,null,null,"LAYER 10",null,{"$f":"SB_Inp2!D26","v":"---"},null,1,"---",null,null,"---",null,null,{"$f":"SB_Inp2!I26","v":"---"},null,1,"---",null,null,"---",null,null,"---",null,null,null,null,null,null,null,null,null,null,null,null,null,null,null,null,null,null,null,null,null,null,null,null,{"$f":"SUM(ED31:ED42)","v":3.0030280830280831},null,{"$f":"SUM(EF31:EF42)","v":0.43339951159951162},null,null,{"$f":"SUM(EI31:EI42)","v":0.83633264069251589},null,null,{"$f":"SUM(EL31:EL42)","v":3.0030280830280831},null,{"$f":"SUM(EN31:EN42)","v":0.43339951159951162},null,null,{"$f":"SUM(EQ31:EQ42)","v":0.83633264069251589},null,null,{"$f":"SUM(ET31:ET42)","v":3.0030280830280831},null,{"$f":"SUM(EV31:EV42)","v":0.43339951159951162},null,null,{"$f":"SUM(EY31:EY42)","v":0.83633264069251589},null,null,{"$f":"SUM(FB31:FB42)","v":3.0030280830280831},null,{"$f":"SUM(FD31:FD42)","v":0.43339951159951162},null,null,{"$f":"SUM(FG31:FG42)","v":0.83633264069251589},null,null,null,{"$f":"SUM(FK31:FK42)","v":3.0030280830280831},null,null,null,{"$f":"SUM(FO31:FO42)","v":0.53412327822473005},null,null,null,null,null,null,null,null,null,null,null,null,"CUFE",null,{"$f":"GD35*GD38*0.024/GD40","v":1.4535373312100603E-2},null,null,{"$f":"GG35*GG38*0.024/GG40","v":9.2868885957375757E-3},null,null,5.2484847163630274E-3,null,null,null,null,null,null,null,null,"LAYER 5",null,"Air Cavity (10 mm) [ISO 6946]",null,null,1,null,null,"m²/m²",null,null,0,null,null,"kg SB-eq",null,null,0,null,null,"MJ",null,null,0,null,null,"kg SO2-eq",null,null,0,null,null,"kg (PO4)3-eq",null,null,0,null,null,"kg C2H4-eq",null,null,0,null,null,"kg CO2-eq",null,null,0,null,null,"kg CFC11-eq",null,null,null,null,null,"U COST A",null,{"$f":"KL12","v":43.867089851851858}]
[null,null,36,{"$f":"Mat_DB!D47","v":"Air Cavity (20 mm) [ISO 6946]"},{"$f":"Mat_DB!H47","v":"Air Cavity"},{"$f":"Mat_DB!J47","v":20},{"$f":"Mat_DB!L47","v":"R [(m²·K)/W]"},{"$f":"Mat_DB!K47","v":"---"},"---","---",{"$f":"Mat_DB!M47","v":"ISO 6946"},{"$f":"IF(Mat_DB!O47=\"\",\"---\",Mat_DB!O47)","v":"---"},{"$f":"IF(Mat_DB!P47=\"\",\"---\",Mat_DB!P47)","v":"m²/m²"},{"$f":"IF(Mat_DB!Q47=\"\",\"---\",Mat_DB!Q47)","v":0},"€/m²",{"$f":"Mat_DB!T47","v":0},"kg SB-eq/m²",{"$f":"Mat_DB!U47","v":0},"MJ/m²",{"$f":"Mat_DB!V47","v":0},"kg SO2-eq/m²",{"$f":"Mat_DB!W47","v":0},"kg (PO4)3-eq/m²",{"$f":"Mat_DB!X47","v":0},"kg C2H4-eq/m²",{"$f":"Mat_DB!Y47","v":0},"kg CO2-eq/m²",{"$f":"Mat_DB!Z47","v":0},"kg CFC11-eq/m²",{"$f":"Mat_DB!AC47","v":"---"},"mm",{"$f":"Mat_DB!AD47","v":"---"},"mm",{"$f":"Mat_DB!AE47","v":"---"},"mm",1,1,7,2,null,7,1,1,1,0,0,0,0,5.5555555555555558E-3,5.5555555555555558E-3,null,null,null,null,"Armamar",7,null,null,null,null,null,null,null,null,null,null,null,null,null,null,null,null,"GL RF",null,{"$f":"SB_Inp1!K23","v":10},null,null,null,null,null,null,null,null,null,null,null,null,null,null,null,null,null,null,null,null,null,null,null,null,null,null,null,null,null,null,"TOTAL",null,null,{"$f":"SUM(DE34:DG43)","v":156.5},null,null,null,null,null,null,null,null,null,null,null,null,null,null,null,null,null,null,null,null,null,null,null,null,null,null,null,null,null,null,null,null,null,null,null,null,null,null,null,null,null,null,null,null,null,null,null,null,null,null,null,null,null,null,null,null,null,null,null,null,null,null,null,null,null,null,null,null,null,null,null,null,null,null,"CTFE",null,{"$f":"GD43*GD36","v":3.4850011053092413},null,null,{"$f":"GG43*GG36","v":2.2266244097140415},null,null,1.2583766955951998,null,null,null,null,null,null,null,null,"LAYER 6",null,"OSB (12 mm) [Kronospan]",null,null,1,null,null,"m²/m²",null,null,9.9000000000000005E-7,null,null,"kg SB-eq",null,null,51.36,null,null,"MJ",null,null,1.1028000000000001E-2,null,null,"kg SO2-eq",null,null,2.6280000000000001E-3,null,null,"kg (PO4)3-eq",null,null,6.2640000000000005E-3,null,null,"kg C2H4-eq",null,null,-9.0359999999999996,null,null,"kg CO2-eq",null,null,1.1315999999999999E-12,null,null,"kg CFC11-eq",null,null,null,null,null,"T COST A",null,{"$f":"KL13","v":10517.573462880004}]
[null,null,37,{"$f":"Mat_DB!D48","v":"Air Cavity (25 mm) [ISO 6946]"},{"$f":"Mat_DB!H48","v":"Air Cavity"},{"$f":"Mat_DB!J48","v":25},{"$f":"Mat_DB!L48","v":"R [(m²·K)/W]"},{"$f":"Mat_DB!K48","v":"---"},"---","---",{"$f":"Mat_DB!M48","v":"ISO 6946"},{"$f":"IF(Mat_DB!O48=\"\",\"---\",Mat_DB!O48)","v":"---"},{"$f":"IF(Mat_DB!P48=\"\",\"---\",Mat_DB!P48)","v":"m²/m²"},{"$f":"IF(Mat_DB!Q48=\"\",\"---\",Mat_DB!Q48)","v":0},"€/m²",{"$f":"Mat_DB!T48","v":0},"kg SB-eq/m²",{"$f":"Mat_DB!U48","v":0},"MJ/m²",{"$f":"Mat_DB!V48","v":0},"kg SO2-eq/m²",{"$f":"Mat_DB!W48","v":0},"kg (PO4)3-eq/m²",{"$f":"Mat_DB!X48","v":0},"kg C2H4-eq/m²",{"$f":"Mat_DB!Y48","v":0},"kg CO2-eq/m²",{"$f":"Mat_DB!Z48","v":0},"kg CFC11-eq/m²",{"$f":"Mat_DB!AC48","v":"---"},"mm",{"$f":"Mat_DB!AD48","v":"---"},"mm",{"$f":"Mat_DB!AE48","v":"---"},"mm",1,1,7,2,null,8,1,1,1,0,0,0,0,"---","---",null,null,null,null,"Arouca",8,null,null,null,null,null,null,null,null,null,null,null,null,null,null,null,null,"# FLOORS",null,{"$f":"SB_Inp1!E26","v":2},null,null,null,null,null,null,null,null,null,null,null,null,null,null,null,null,null,null,null,null,null,null,null,null,null,null,null,null,null,null,null,null,null,null,null,null,null,null,null,null,null,null,null,null,null,null,null,null,null,null,null,null,null,null,null,null,null,null,"Rupper",null,null,null,"Rlower",null,null,null,"Rupper",null,null,null,"Rlower",null,null,null,"Rupper",null,null,null,"Rlower",null,null,null,"Rupper",null,null,null,"Rlower",null,null,null,null,null,null,null,null,null,null,null,null,null,null,null,null,null,null,null,null,null,"UFE",null,{"$f":"GD41+GD43","v":17.653210887546184},null,null,{"$f":"GG41+GG43","v":13.478370981947133},null,null,4.1748399055990504,null,null,"% SAVED ENERGY",null,null,null,null,null,"LAYER 7",null,"Mortar (10 mm)",null,null,1,null,null,"m²/m²",null,null,3.1700000000000001E-6,null,null,"kg SB-eq",null,null,9.0500000000000007,null,null,"MJ",null,null,4.8799999999999998E-3,null,null,"kg SO2-eq",null,null,9.9799999999999997E-4,null,null,"kg (PO4)3-eq",null,null,2.4499999999999999E-4,null,null,"kg C2H4-eq",null,null,1.42,null,null,"kg CO2-eq",null,null,9.6600000000000005E-8,null,null,"kg CFC11-eq",null,null,null,null,null,"U COST B",null,{"$f":"KL29","v":44.462423185185195}]
[null,null,38,{"$f":"Mat_DB!D49","v":"Air Cavity (90 mm) [ISO 6946]"},{"$f":"Mat_DB!H49","v":"Air Cavity"},{"$f":"Mat_DB!J49","v":90},{"$f":"Mat_DB!L49","v":"R [(m²·K)/W]"},{"$f":"Mat_DB!K49","v":"---"},"---","---",{"$f":"Mat_DB!M49","v":"ISO 6946"},{"$f":"IF(Mat_DB!O49=\"\",\"---\",Mat_DB!O49)","v":"---"},{"$f":"IF(Mat_DB!P49=\"\",\"---\",Mat_DB!P49)","v":"m²/m²"},{"$f":"IF(Mat_DB!Q49=\"\",\"---\",Mat_DB!Q49)","v":0},"€/m²",{"$f":"Mat_DB!T49","v":0},"kg SB-eq/m²",{"$f":"Mat_DB!U49","v":0},"MJ/m²",{"$f":"Mat_DB!V49","v":0},"kg SO2-eq/m²",{"$f":"Mat_DB!W49","v":0},"kg (PO4)3-eq/m²",{"$f":"Mat_DB!X49","v":0},"kg C2H4-eq/m²",{"$f":"Mat_DB!Y49","v":0},"kg CO2-eq/m²",{"$f":"Mat_DB!Z49","v":0},"kg CFC11-eq/m²",{"$f":"Mat_DB!AC49","v":"---"},"mm",{"$f":"Mat_DB!AD49","v":"---"},"mm",{"$f":"Mat_DB!AE49","v":"---"},"mm",1,1,7,2,null,9,1,1,1,0,0,0,0,"---","---",null,null,null,null,"Arraiolos",25,null,null,null,null,null,null,null,null,null,null,null,null,null,null,null,null,"FLOOR HEIGHT",null,{"$f":"SB_Inp1!E27","v":2.7},null,null,null,null,null,null,null,null,null,null,null,null,null,null,null,null,null,null,null,null,null,null,null,null,null,null,null,null,null,null,null,null,null,null,null,null,null,null,null,null,null,null,null,null,null,null,null,null,null,null,null,null,null,null,null,null,null,null,{"$f":"1/($DS$21/ED43+$DS$20/EF43)","v":2.9377116634516813},"[(m2 .K)/W]",null,null,{"$f":"EI43","v":0.83633264069251589},"[(m2 .K)/W]",null,null,{"$f":"ED46","v":2.9377116634516813},"[(m2 .K)/W]",null,null,{"$f":"EH46","v":0.83633264069251589},"[(m2 .K)/W]",null,null,{"$f":"ED46","v":2.9377116634516813},"[(m2 .K)/W]",null,null,{"$f":"EH46","v":0.83633264069251589},"[(m2 .K)/W]",null,null,{"$f":"ED46","v":2.9377116634516813},"[(m2 .K)/W]",null,null,{"$f":"EH46","v":0.83633264069251589},"[(m2 .K)/W]",null,null,null,null,null,null,null,null,null,null,null,null,null,null,null,null,null,null,null,null,"TFE",null,{"$f":"GD42+GD44","v":4232.5338423980738},null,null,{"$f":"GG42+GG44","v":3231.5742266316456},null,null,1000.9596157664282,null,null,{"$f":"1-GG46/GD46","v":0.23649181625900562},null,null,null,null,null,"LAYER 8",null,"---",null,null,"---",null,null,"---",null,null,"---",null,null,"kg SB-eq",null,null,"---",null,null,"MJ",null,null,"---",null,null,"kg SO2-eq",null,null,"---",null,null,"kg (PO4)3-eq",null,null,"---",null,null,"kg C2H4-eq",null,null,"---",null,null,"kg CO2-eq",null,null,"---",null,null,"kg CFC11-eq",null,null,null,null,null,"T COST B",null,{"$f":"KL30","v":10660.310582880003}]
[null,null,39,{"$f":"Mat_DB!D50","v":"Air Cavity (150 mm) [ISO 6946]"},{"$f":"Mat_DB!H50","v":"Air Cavity"},{"$f":"Mat_DB!J50","v":150},{"$f":"Mat_DB!L50","v":"R [(m²·K)/W]"},{"$f":"Mat_DB!K50","v":"---"},"---","---",{"$f":"Mat_DB!M50","v":"ISO 6946"},{"$f":"IF(Mat_DB!O50=\"\",\"---\",Mat_DB!O50)","v":"---"},{"$f":"IF(Mat_DB!P50=\"\",\"---\",Mat_DB!P50)","v":"m²/m²"},{"$f":"IF(Mat_DB!Q50=\"\",\"---\",Mat_DB!Q50)","v":0},"€/m²",{"$f":"Mat_DB!T50","v":0},"kg SB-eq/m²",{"$f":"Mat_DB!U50","v":0},"MJ/m²",{"$f":"Mat_DB!V50","v":0},"kg SO2-eq/m²",{"$f":"Mat_DB!W50","v":0},"kg (PO4)3-eq/m²",{"$f":"Mat_DB!X50","v":0},"kg C2H4-eq/m²",{"$f":"Mat_DB!Y50","v":0},"kg CO2-eq/m²",{"$f":"Mat_DB!Z50","v":0},"kg CFC11-eq/m²",{"$f":"Mat_DB!AC50","v":"---"},"mm",{"$f":"Mat_DB!AD50","v":"---"},"mm",{"$f":"Mat_DB!AE50","v":"---"},"mm",1,1,7,2,null,10,1,1,1,0,0,0,0,"---","---",null,null,null,null,"Arronches",24,null,null,null,null,null,null,null,null,null,null,null,null,null,null,null,null,null,null,null,null,null,null,null,null,null,null,null,null,null,null,null,null,null,null,null,null,null,null,null,null,null,null,null,null,null,null,null,null,null,null,null,null,null,null,null,null,null,null,null,null,null,null,null,null,null,null,null,null,null,null,null,null,null,null,null,null,null,null,null,null,null,null,null,null,null,null,null,null,null,null,null,null,null,null,null,null,null,null,null,null,null,null,null,null,null,null,null,null,null,null,null,null,null,null,null,null,null,null,null,null,null,null,null,null,null,null,null,null,null,null,null,null,null,null,null,null,null,null,null,null,null,null,null,null,"LAYER 9",null,"---",null,null,"---",null,null,"---",null,null,"---",null,null,"kg SB-eq",null,null,"---",null,null,"MJ",null,null,"---",null,null,"kg SO2-eq",null,null,"---",null,null,"kg (PO4)3-eq",null,null,"---",null,null,"kg C2H4-eq",null,null,"---",null,null,"kg CO2-eq",null,null,"---",null,null,"kg CFC11-eq",null,null,null,null,null,"EL. COST A",null,{"$f":"CC15","v":0.25}]
[null,null,40,{"$f":"Mat_DB!D51","v":"Air Cavity (200 mm) [ISO 6946]"},{"$f":"Mat_DB!H51","v":"Air Cavity"},{"$f":"Mat_DB!J51","v":200},{"$f":"Mat_DB!L51","v":"R [(m²·K)/W]"},{"$f":"Mat_DB!K51","v":"---"},"---","---",{"$f":"Mat_DB!M51","v":"ISO 6946"},{"$f":"IF(Mat_DB!O51=\"\",\"---\",Mat_DB!O51)","v":"---"},{"$f":"IF(Mat_DB!P51=\"\",\"---\",Mat_DB!P51)","v":"m²/m²"},{"$f":"IF(Mat_DB!Q51=\"\",\"---\",Mat_DB!Q51)","v":0},"€/m²",{"$f":"Mat_DB!T51","v":0},"kg SB-eq/m²",{"$f":"Mat_DB!U51","v":0},"MJ/m²",{"$f":"Mat_DB!V51","v":0},"kg SO2-eq/m²",{"$f":"Mat_DB!W51","v":0},"kg (PO4)3-eq/m²",{"$f":"Mat_DB!X51","v":0},"kg C2H4-eq/m²",{"$f":"Mat_DB!Y51","v":0},"kg CO2-eq/m²",{"$f":"Mat_DB!Z51","v":0},"kg CFC11-eq/m²",{"$f":"Mat_DB!AC51","v":"---"},"mm",{"$f":"Mat_DB!AD51","v":"---"},"mm",{"$f":"Mat_DB!AE51","v":"---"},"mm",1,1,7,2,null,null,{"$f":"SUM(AP38:AP47)","v":12},{"$f":"SUM(AQ38:AQ47)","v":12},{"$f":"SUM(AR38:AR47)","v":16},{"$f":"SUM(AS38:AS47)","v":20},{"$f":"IF(AS48=5,0.11,IF(AS48=10,0.15,IF(AS48>=25,0.18,IF(AS48<5,0.11*(AS48/5),IF(AS48<10,0.11+((AS48-5)/5)*0.04,IF(AS48<15,0.15+((AS48-10)/5)*0.02,IF(AS48<25,0.17+((AS48-15)/10)*0.01,0)))))))","v":0.17500000000000002},null,null,null,null,null,null,null,null,"Arruda dos Vinhos",19,null,null,null,null,null,null,null,null,null,null,null,null,null,null,null,null,null,null,null,null,null,null,null,null,null,null,null,null,null,null,null,null,null,null,null,null,null,null,null,null,null,null,null,null,null,null,null,null,null,null,null,null,null,null,null,null,null,null,null,null,null,null,null,null,null,null,null,null,null,null,null,null,null,null,null,null,null,null,null,null,null,"Rtotal",null,null,null,"p",null,null,null,"Rtotal",null,null,null,"p",null,null,null,"Rtotal",null,null,null,"p",null,null,null,"Rtotal",null,null,null,null,null,null,null,"Rtotal",null,null,null,null,null,null,null,null,null,null,null,null,null,"RESULTS",null,null,null,null,null,null,null,null,null,null,null,null,null,null,null,null,"LAYER 10",null,"---",null,null,"---",null,null,"---",null,null,"---",null,null,"kg SB-eq",null,null,"---",null,null,"MJ",null,null,"---",null,null,"kg SO2-eq",null,null,"---",null,null,"kg (PO4)3-eq",null,null,"---",null,null,"kg C2H4-eq",null,null,"---",null,null,"kg CO2-eq",null,null,"---",null,null,"kg CFC11-eq",null,null,null,null,null,"EL. COST B",null,{"$f":"CC35","v":0.25}]
[null,null,41,{"$f":"Mat_DB!D52","v":"Mortar (10 mm)"},{"$f":"Mat_DB!H52","v":"Other"},{"$f":"Mat_DB!J52","v":10},{"$f":"Mat_DB!L52","v":"λ [W/(m·K)]"},{"$f":"Mat_DB!K52","v":1.8},1.8,"---",{"$f":"Mat_DB!M52","v":"ITE50"},{"$f":"IF(Mat_DB!O52=\"\",\"---\",Mat_DB!O52)","v":1},{"$f":"IF(Mat_DB!P52=\"\",\"---\",Mat_DB!P52)","v":"m²/m²"},{"$f":"IF(Mat_DB!Q52=\"\",\"---\",Mat_DB!Q52)","v":2.44},"€/m²",{"$f":"Mat_DB!T52","v":3.1700000000000001E-6},"kg SB-eq/m²",{"$f":"Mat_DB!U52","v":9.0500000000000007},"MJ/m²",{"$f":"Mat_DB!V52","v":4.8799999999999998E-3},"kg SO2-eq/m²",{"$f":"Mat_DB!W52","v":9.9799999999999997E-4},"kg (PO4)3-eq/m²",{"$f":"Mat_DB!X52","v":2.4499999999999999E-4},"kg C2H4-eq/m²",{"$f":"Mat_DB!Y52","v":1.42},"kg CO2-eq/m²",{"$f":"Mat_DB!Z52","v":9.6600000000000005E-8},"kg CFC11-eq/m²",{"$f":"Mat_DB!AC52","v":"---"},"mm",{"$f":"Mat_DB!AD52","v":"---"},"mm",{"$f":"Mat_DB!AE52","v":"---"},"mm",1,2,4,2,null,null,null,null,null,null,null,null,null,null,null,null,null,null,null,"Aveiro",9,null,null,null,null,null,null,null,null,null,null,null,null,null,null,null,null,"MCA",null,null,null,null,null,null,null,null,null,null,null,null,null,null,null,null,null,null,null,null,null,null,null,null,null,null,null,null,null,null,null,null,null,null,null,null,null,null,null,null,null,null,null,null,null,null,null,null,null,null,null,null,null,null,null,null,null,null,null,null,null,null,null,null,{"$f":"(ED46+EH46)/2","v":1.8870221520720987},"[(m2 .K)/W]",null,null,{"$f":"0.8*(EP46/EL46)+0.1","v":0.32775077652375512},null,null,null,{"$f":"EL46*EL49+EP46*(1-EL49)","v":1.525061247172562},"[(m2 .K)/W]",null,null,{"$f":"EV53","v":0.25},null,null,null,{"$f":"ET46*ET49+EX46*(1-ET49)","v":1.3616773963823072},"[(m2 .K)/W]",null,null,{"$f":"0.8*(FF46/FB46)+0.44-0.1*(DM15/0.04)-0.2*(0.6/DM14)-0.04*(DM12/0.1)","v":0.22425077652375511},null,null,null,{"$f":"FB46*FB49+FF46*(1-FB49)","v":1.3075685183169883},"[(m2 .K)/W]",null,null,null,null,null,null,{"$f":"1/(DS16/FO43+DS17/FK43)","v":1.455561576800291},"[(m2 .K)/W]",null,null,null,null,null,null,null,null,null,null,null,null,null,null,null,null,null,null,null,null,null,null,null,null,null,null,null,null,null,null,null,"Material 2",null,null,"Unit Consumption",null,null,null,null,null,"Indicator",null,null,null,null,null,"Indicator",null,null,null,null,null,"Indicator",null,null,null,null,null,"Indicator",null,null,null,null,null,"Indicator",null,null,null,null,null,"Indicator",null,null,null,null,null,"Indicator",null,null,null,null,null,null,null,null,"UEB",null,{"$f":"GJ63","v":0.97535104131530215}]
[null,null,42,{"$f":"Mat_DB!D53","v":0},{"$f":"Mat_DB!H53","v":0},{"$f":"Mat_DB!J53","v":0},{"$f":"Mat_DB!L53","v":0},{"$f":"Mat_DB!K53","v":0},"---","---",{"$f":"Mat_DB!M53","v":0},{"$f":"IF(Mat_DB!O53=\"\",\"---\",Mat_DB!O53)","v":"---"},{"$f":"IF(Mat_DB!P53=\"\",\"---\",Mat_DB!P53)","v":"---"},{"$f":"IF(Mat_DB!Q53=\"\",\"---\",Mat_DB!Q53)","v":"---"},"---",{"$f":"Mat_DB!T53","v":0},"---",{"$f":"Mat_DB!U53","v":0},"---",{"$f":"Mat_DB!V53","v":0},"---",{"$f":"Mat_DB!W53","v":0},"---",{"$f":"Mat_DB!X53","v":0},"---",{"$f":"Mat_DB!Y53","v":0},"---",{"$f":"Mat_DB!Z53","v":0},"---",{"$f":"Mat_DB!AC53","v":0},"---",{"$f":"Mat_DB!AD53","v":0},"---",{"$f":"Mat_DB!AE53","v":0},"---",1,"---","---","---",null,null,null,null,null,null,null,null,null,null,null,null,null,null,null,"Avis",24,null,null,null,null,null,null,null,null,null,null,null,null,null,null,null,null,null,null,null,null,null,null,null,null,null,null,null,null,null,null,null,null,null,null,null,null,null,null,null,null,null,null,null,null,null,null,null,null,null,null,null,null,null,null,null,null,null,null,null,null,null,null,null,null,null,null,null,null,null,null,null,null,null,null,null,null,null,null,null,null,null,null,null,null,null,null,null,null,null,null,null,null,null,null,null,null,null,null,null,null,null,null,null,null,null,null,null,null,null,null,null,null,null,null,null,null,null,null,null,null,null,null,null,null,null,null,null,null,null,"SOLUTION A",null,null,"SOLUTION B",null,null,null,null,null,null,null,null,null,null,null,"LAYER 1",null,{"$f":"CV34","v":"---"},null,null,{"$f":"IF(VLOOKUP(CX34,$C$9:$AV$61,36)=1,$AT$17,IF(VLOOKUP(CX34,$C$9:$AV$61,36)=6,$AT$17,VLOOKUP(CX34,$C$9:$AV$61,10)))","v":"---"},null,null,{"$f":"VLOOKUP(CX34,$C$9:$AV$61,11)","v":"---"},null,null,{"$f":"VLOOKUP(CX34,$C$9:$AV$61,14)","v":"---"},null,null,"kg SB-eq",null,null,{"$f":"VLOOKUP(CX34,$C$9:$AV$61,16)","v":"---"},null,null,"MJ",null,null,{"$f":"IF(VLOOKUP(CX34,$C$9:$AV$61,36)=7,$HD$185,VLOOKUP(CX34,$C$9:$AV$61,18))","v":"---"},null,null,"kg SO2-eq",null,null,{"$f":"VLOOKUP(CX34,$C$9:$AV$61,20)","v":"---"},null,null,"kg (PO4)3-eq",null,null,{"$f":"VLOOKUP(CX34,$C$9:$AV$61,22)","v":"---"},null,null,"kg C2H4-eq",null,null,{"$f":"VLOOKUP(CX34,$C$9:$AV$61,24)","v":"---"},null,null,"kg CO2-eq",null,null,{"$f":"VLOOKUP(CX34,$C$9:$AV$61,26)","v":"---"},null,null,"kg CFC11-eq",null,null,null,null,null,"TEB",null,{"$f":"GJ64","v":233.85016566575723}]
[null,null,43,{"$f":"Mat_DB!D54","v":0},{"$f":"Mat_DB!H54","v":0},{"$f":"Mat_DB!J54","v":0},{"$f":"Mat_DB!L54","v":0},{"$f":"Mat_DB!K54","v":0},"---","---",{"$f":"Mat_DB!M54","v":0},{"$f":"IF(Mat_DB!O54=\"\",\"---\",Mat_DB!O54)","v":"---"},{"$f":"IF(Mat_DB!P54=\"\",\"---\",Mat_DB!P54)","v":"---"},{"$f":"IF(Mat_DB!Q54=\"\",\"---\",Mat_DB!Q54)","v":"---"},"---",{"$f":"Mat_DB!T54","v":0},"---",{"$f":"Mat_DB!U54","v":0},"---",{"$f":"Mat_DB!V54","v":0},"---",{"$f":"Mat_DB!W54","v":0},"---",{"$f":"Mat_DB!X54","v":0},"---",{"$f":"Mat_DB!Y54","v":0},"---",{"$f":"Mat_DB!Z54","v":0},"---",{"$f":"Mat_DB!AC54","v":0},"---",{"$f":"Mat_DB!AD54","v":0},"---",{"$f":"Mat_DB!AE54","v":0},"---",1,"---","---","---",null,null,null,null,null,null,null,null,null,null,null,null,null,null,null,"Azambuja",21,null,null,null,null,null,null,null,null,null,null,null,null,null,null,null,null,"UVC",null,{"$f":"MCA_Inp!#REF!","v":{"$error":"#REF!"}},null,null,null,null,null,null,null,null,null,null,null,null,null,null,null,null,null,null,null,null,null,null,null,null,null,null,null,null,null,null,null,null,null,null,null,null,null,null,null,null,null,null,null,null,null,null,null,null,null,null,null,null,null,null,null,null,null,null,null,null,null,null,null,null,null,null,null,null,null,null,null,null,null,null,{"$f":"VLOOKUP(CO14,$C$9:$AV$61,36)","v":5},{"$f":"IF(ET51=3,2,1)","v":1},{"$f":"IF($DM$14<0.5,1,2)","v":1},null,null,null,null,null,null,null,null,null,null,null,null,null,null,null,null,null,null,null,null,null,null,null,null,null,null,null,null,null,null,null,"U",null,{"$f":"IF($BY$13=1,GD20,GD35)","v":0.52993548533700119},null,null,{"$f":"IF($BY$33=1,GG20,GG35)","v":0.45144597340390985},null,null,null,null,null,null,null,null,null,null,null,"LAYER 2",null,"---",null,null,"---",null,null,"---",null,null,"---",null,null,"kg SB-eq",null,null,"---",null,null,"MJ",null,null,"---",null,null,"kg SO2-eq",null,null,"---",null,null,"kg (PO4)3-eq",null,null,"---",null,null,"kg C2H4-eq",null,null,"---",null,null,"kg CO2-eq",null,null,"---",null,null,"kg CFC11-eq",null,null,null,null,null,"IC",null,{"$f":"IY46-IY44","v":142.73711999999978}]
[null,null,44,{"$f":"Mat_DB!D55","v":0},{"$f":"Mat_DB!H55","v":0},{"$f":"Mat_DB!J55","v":0},{"$f":"Mat_DB!L55","v":0},{"$f":"Mat_DB!K55","v":0},"---","---",{"$f":"Mat_DB!M55","v":0},{"$f":"IF(Mat_DB!O55=\"\",\"---\",Mat_DB!O55)","v":"---"},{"$f":"IF(Mat_DB!P55=\"\",\"---\",Mat_DB!P55)","v":"---"},{"$f":"IF(Mat_DB!Q55=\"\",\"---\",Mat_DB!Q55)","v":"---"},"---",{"$f":"Mat_DB!T55","v":0},"---",{"$f":"Mat_DB!U55","v":0},"---",{"$f":"Mat_DB!V55","v":0},"---",{"$f":"Mat_DB!W55","v":0},"---",{"$f":"Mat_DB!X55","v":0},"---",{"$f":"Mat_DB!Y55","v":0},"---",{"$f":"Mat_DB!Z55","v":0},"---",{"$f":"Mat_DB!AC55","v":0},"---",{"$f":"Mat_DB!AD55","v":0},"---",{"$f":"Mat_DB!AE55","v":0},"---",1,"---","---","---",null,null,null,null,null,null,null,null,null,null,null,null,null,null,null,"Baião",6,null,null,null,null,null,null,null,null,null,null,null,null,null,null,null,null,"EB",null,{"$f":"MCA_Inp!F15","v":0.35},null,null,null,null,null,null,null,null,null,null,null,null,null,null,null,null,null,null,null,null,null,null,null,null,null,null,null,null,null,null,null,null,null,null,null,null,null,null,null,"SOLUTION B",null,null,null,null,null,null,null,null,null,null,null,null,null,null,null,null,null,null,null,null,null,null,null,null,null,null,null,null,null,null,null,null,null,null,{"$f":"VLOOKUP(CO15,$C$9:$AV$61,36)","v":5},{"$f":"IF(ET52=3,2,1)","v":1},{"$f":"EU61*EV51","v":10},null,null,null,null,null,null,null,null,null,null,null,null,null,null,null,null,null,null,null,null,null,null,null,null,null,null,null,null,null,null,null,"A",null,{"$f":"IF($BY$13=1,GD21,GD36)","v":239.76000000000005},null,null,{"$f":"IF($BY$33=1,GG21,GG36)","v":239.76000000000005},null,null,null,null,null,null,null,null,null,null,null,"LAYER 3",null,"TB Strip XPS (10 mm) [IFoam]",null,null,3.3074074074074078,null,null,"m²/m²",null,null,{"$f":"VLOOKUP(CX36,$C$9:$AV$61,14)","v":3.7647058823529416E-7},null,null,"kg SB-eq",null,null,{"$f":"VLOOKUP(CX36,$C$9:$AV$61,16)","v":16.441176470588236},null,null,"MJ",null,null,3.0588235294117649E-3,null,null,"kg SO2-eq",null,null,{"$f":"VLOOKUP(CX36,$C$9:$AV$61,20)","v":3.9705882352941181E-4},null,null,"kg (PO4)3-eq",null,null,{"$f":"VLOOKUP(CX36,$C$9:$AV$61,22)","v":1.8529411764705883E-4},null,null,"kg C2H4-eq",null,null,{"$f":"VLOOKUP(CX36,$C$9:$AV$61,24)","v":0.75588235294117645},null,null,"kg CO2-eq",null,null,{"$f":"VLOOKUP(CX36,$C$9:$AV$61,26)","v":2.5058823529411764E-8},null,null,"kg CFC11-eq",null,null,null,null,null,"B",null,{"$f":"(0.5*IY47+0.5*IY48)*IY50","v":58.462541416439308}]
[null,null,45,{"$f":"Mat_DB!D56","v":0},{"$f":"Mat_DB!H56","v":0},{"$f":"Mat_DB!J56","v":0},{"$f":"Mat_DB!L56","v":0},{"$f":"Mat_DB!K56","v":0},"---","---",{"$f":"Mat_DB!M56","v":0},{"$f":"IF(Mat_DB!O56=\"\",\"---\",Mat_DB!O56)","v":"---"},{"$f":"IF(Mat_DB!P56=\"\",\"---\",Mat_DB!P56)","v":"---"},{"$f":"IF(Mat_DB!Q56=\"\",\"---\",Mat_DB!Q56)","v":"---"},"---",{"$f":"Mat_DB!T56","v":0},"---",{"$f":"Mat_DB!U56","v":0},"---",{"$f":"Mat_DB!V56","v":0},"---",{"$f":"Mat_DB!W56","v":0},"---",{"$f":"Mat_DB!X56","v":0},"---",{"$f":"Mat_DB!Y56","v":0},"---",{"$f":"Mat_DB!Z56","v":0},"---",{"$f":"Mat_DB!AC56","v":0},"---",{"$f":"Mat_DB!AD56","v":0},"---",{"$f":"Mat_DB!AE56","v":0},"---",1,"---","---","---",null,null,null,null,null,null,null,null,null,null,null,null,null,null,null,"Barcelos",3,null,null,null,null,null,null,null,null,null,null,null,null,null,null,null,null,"CBA",null,{"$f":"MCA_Inp!F16","v":0.15},null,null,null,null,null,null,null,null,null,null,null,null,null,null,null,null,null,null,null,null,null,null,null,null,null,null,null,null,null,null,null,null,null,null,null,null,null,null,null,null,null,null,null,null,null,null,null,null,null,null,null,null,null,null,null,null,null,null,null,null,null,null,null,null,null,null,null,null,null,null,null,null,null,null,2,1,{"$f":"IF(EV52=20,0.3,IF(EV52=22,0.5,IF(EV52=10,0.25,IF(EV52=11,0.4,0.4))))","v":0.25},null,null,null,null,null,null,null,null,null,null,null,null,null,null,null,null,null,null,null,null,null,null,null,null,null,null,null,null,null,null,null,"L",null,{"$f":"IF($BY$13=1,GD11,GD34)","v":"Coimbra"},null,null,{"$f":"IF($BY$33=1,GG11,GG34)","v":"Coimbra"},null,null,null,null,null,null,null,null,null,null,null,"LAYER 4",null,"Steel C90/U93 (90 mm) [Pertecno]",null,null,{"$f":"IF(VLOOKUP(CX37,$C$9:$AV$61,36)=1,$AT$17,IF(VLOOKUP(CX37,$C$9:$AV$61,36)=6,$AT$17,VLOOKUP(CX37,$C$9:$AV$61,10)))","v":3.3074074074074078},null,null,"m/m²",null,null,{"$f":"VLOOKUP(CX37,$C$9:$AV$61,14)","v":1.3118837600000001E-7},null,null,"kg SB-eq",null,null,{"$f":"VLOOKUP(CX37,$C$9:$AV$61,16)","v":72.901300000000006},null,null,"MJ",null,null,{"$f":"IF(VLOOKUP(CX37,$C$9:$AV$61,36)=7,$HD$185,VLOOKUP(CX37,$C$9:$AV$61,18))","v":2.5764120000000004E-5},null,null,"kg SO2-eq",null,null,{"$f":"VLOOKUP(CX37,$C$9:$AV$61,20)","v":1.501694E-6},null,null,"kg (PO4)3-eq",null,null,{"$f":"VLOOKUP(CX37,$C$9:$AV$61,22)","v":4.6603460000000003E-4},null,null,"kg C2H4-eq",null,null,{"$f":"VLOOKUP(CX37,$C$9:$AV$61,24)","v":5.5312800000000013E-3},null,null,"kg CO2-eq",null,null,{"$f":"VLOOKUP(CX37,$C$9:$AV$61,26)","v":0},null,null,"kg CFC11-eq",null,null,null,null,null,"PB",null,{"$f":"IY51/IY52","v":2.441514113853815}]
[null,null,46,{"$f":"Mat_DB!D57","v":0},{"$f":"Mat_DB!H57","v":0},{"$f":"Mat_DB!J57","v":0},{"$f":"Mat_DB!L57","v":0},{"$f":"Mat_DB!K57","v":0},"---","---",{"$f":"Mat_DB!M57","v":0},{"$f":"IF(Mat_DB!O57=\"\",\"---\",Mat_DB!O57)","v":"---"},{"$f":"IF(Mat_DB!P57=\"\",\"---\",Mat_DB!P57)","v":"---"},{"$f":"IF(Mat_DB!Q57=\"\",\"---\",Mat_DB!Q57)","v":"---"},"---",{"$f":"Mat_DB!T57","v":0},"---",{"$f":"Mat_DB!U57","v":0},"---",{"$f":"Mat_DB!V57","v":0},"---",{"$f":"Mat_DB!W57","v":0},"---",{"$f":"Mat_DB!X57","v":0},"---",{"$f":"Mat_DB!Y57","v":0},"---",{"$f":"Mat_DB!Z57","v":0},"---",{"$f":"Mat_DB!AC57","v":0},"---",{"$f":"Mat_DB!AD57","v":0},"---",{"$f":"Mat_DB!AE57","v":0},"---",1,"---","---","---",null,null,null,null,null,null,null,null,null,null,null,null,null,null,null,"Barrancos",27,null,null,null,null,null,null,null,null,null,null,null,null,null,null,null,null,"LCA",null,{"$f":"MCA_Inp!F17","v":0.5},null,null,null,null,null,null,null,null,null,null,null,null,null,null,null,null,null,null,null,null,null,null,null,null,null,null,null,null,null,null,null,null,null,null,null,null,null,null,null,null,null,null,null,null,null,null,null,null,null,null,null,null,null,null,null,null,null,null,null,null,null,null,null,null,null,null,null,null,null,null,null,null,null,null,5,1,null,null,null,null,null,null,null,null,null,null,null,null,null,null,null,null,null,null,null,null,null,null,null,null,null,null,null,null,null,null,null,null,"E",null,{"$f":"IF($BY$13=1,GD12*1000,\"---\")","v":75},null,null,{"$f":"IF($BY$33=1,GG12*1000,\"---\")","v":75},null,null,null,null,null,null,null,null,null,null,null,"LAYER 5",null,"TB Strip XPS (10 mm) [IFoam]",null,null,{"$f":"IF(VLOOKUP(CX38,$C$9:$AV$61,36)=1,$AT$17,IF(VLOOKUP(CX38,$C$9:$AV$61,36)=6,$AT$17,VLOOKUP(CX38,$C$9:$AV$61,10)))","v":3.3074074074074078},null,null,"m²/m²",null,null,3.7647058823529416E-7,null,null,"kg SB-eq",null,null,16.441176470588236,null,null,"MJ",null,null,{"$f":"IF(VLOOKUP(CX38,$C$9:$AV$61,36)=7,$HD$185,VLOOKUP(CX38,$C$9:$AV$61,18))","v":3.0588235294117649E-3},null,null,"kg SO2-eq",null,null,3.9705882352941181E-4,null,null,"kg (PO4)3-eq",null,null,1.8529411764705883E-4,null,null,"kg C2H4-eq",null,null,0.75588235294117645,null,null,"kg CO2-eq",null,null,2.5058823529411764E-8,null,null,"kg CFC11-eq"]
[null,null,47,{"$f":"Mat_DB!D58","v":0},{"$f":"Mat_DB!H58","v":0},{"$f":"Mat_DB!J58","v":0},{"$f":"Mat_DB!L58","v":0},{"$f":"Mat_DB!K58","v":0},"---","---",{"$f":"Mat_DB!M58","v":0},{"$f":"IF(Mat_DB!O58=\"\",\"---\",Mat_DB!O58)","v":"---"},{"$f":"IF(Mat_DB!P58=\"\",\"---\",Mat_DB!P58)","v":"---"},{"$f":"IF(Mat_DB!Q58=\"\",\"---\",Mat_DB!Q58)","v":"---"},"---",{"$f":"Mat_DB!T58","v":0},"---",{"$f":"Mat_DB!U58","v":0},"---",{"$f":"Mat_DB!V58","v":0},"---",{"$f":"Mat_DB!W58","v":0},"---",{"$f":"Mat_DB!X58","v":0},"---",{"$f":"Mat_DB!Y58","v":0},"---",{"$f":"Mat_DB!Z58","v":0},"---",{"$f":"Mat_DB!AC58","v":0},"---",{"$f":"Mat_DB!AD58","v":0},"---",{"$f":"Mat_DB!AE58","v":0},"---",1,"---","---","---",null,null,null,null,null,null,null,null,null,null,null,null,null,null,null,"Barreiro",23,null,null,null,null,null,null,null,null,null,null,null,null,null,null,null,null,null,null,null,null,null,null,null,null,null,null,null,null,null,null,null,null,null,null,null,null,null,null,null,null,null,null,null,null,null,null,null,null,null,null,null,null,null,null,null,null,null,null,"WALL",null,null,null,null,null,"AREA FACTORS",null,null,null,null,null,"R-VALUE | U-VALUE",null,null,null,null,null,null,null,null,null,null,null,null,null,null,null,null,null,null,null,null,null,null,4,1,null,null,null,null,null,null,null,null,null,null,null,null,null,null,null,null,null,null,null,null,null,null,null,null,null,null,null,null,null,null,null,null,"HDD",null,{"$f":"IF($BY$13=1,GL10,GD37)","v":1312},null,null,{"$f":"IF($BY$33=1,GN10,GG37)","v":1312},null,null,null,null,null,null,null,null,null,null,null,"LAYER 6",null,"---",null,null,"---",null,null,"---",null,null,"---",null,null,"kg SB-eq",null,null,"---",null,null,"MJ",null,null,"---",null,null,"kg SO2-eq",null,null,"---",null,null,"kg (PO4)3-eq",null,null,"---",null,null,"kg C2H4-eq",null,null,"---",null,null,"kg CO2-eq",null,null,"---",null,null,"kg CFC11-eq"]
[null,null,48,{"$f":"Mat_DB!D59","v":0},{"$f":"Mat_DB!H59","v":0},{"$f":"Mat_DB!J59","v":0},{"$f":"Mat_DB!L59","v":0},{"$f":"Mat_DB!K59","v":0},"---","---",{"$f":"Mat_DB!M59","v":0},{"$f":"IF(Mat_DB!O59=\"\",\"---\",Mat_DB!O59)","v":"---"},{"$f":"IF(Mat_DB!P59=\"\",\"---\",Mat_DB!P59)","v":"---"},{"$f":"IF(Mat_DB!Q59=\"\",\"---\",Mat_DB!Q59)","v":"---"},"---",{"$f":"Mat_DB!T59","v":0},"---",{"$f":"Mat_DB!U59","v":0},"---",{"$f":"Mat_DB!V59","v":0},"---",{"$f":"Mat_DB!W59","v":0},"---",{"$f":"Mat_DB!X59","v":0},"---",{"$f":"Mat_DB!Y59","v":0},"---",{"$f":"Mat_DB!Z59","v":0},"---",{"$f":"Mat_DB!AC59","v":0},"---",{"$f":"Mat_DB!AD59","v":0},"---",{"$f":"Mat_DB!AE59","v":0},"---",1,"---","---","---",null,null,null,null,null,null,null,null,null,null,null,null,null,null,null,"Batalha",18,null,null,null,null,null,null,null,null,null,null,null,null,null,null,null,null,"ADPE",null,{"$f":"MCA_Inp!J20","v":0.14000000000000001},null,null,null,null,null,null,null,null,null,null,null,null,null,null,null,null,null,null,null,null,null,null,null,null,null,null,null,null,null,null,null,null,null,null,null,null,null,null,null,null,null,null,null,null,null,null,null,null,null,null,null,null,null,null,null,null,null,null,null,null,null,null,null,null,null,null,null,null,null,null,null,null,null,null,0,1,null,null,null,null,null,null,null,null,null,null,null,null,null,null,null,null,null,null,null,null,null,null,null,null,null,null,null,null,null,null,null,null,"CDD",null,{"$f":"IF($BY$13=1,GL11,GD38)","v":500.20000000000022},null,null,{"$f":"IF($BY$33=1,GN11,GG38)","v":500.20000000000022},null,null,null,null,null,null,null,null,null,null,null,"LAYER 7",null,"---",null,null,"---",null,null,"---",null,null,"---",null,null,"kg SB-eq",null,null,"---",null,null,"MJ",null,null,"---",null,null,"kg SO2-eq",null,null,"---",null,null,"kg (PO4)3-eq",null,null,"---",null,null,"kg C2H4-eq",null,null,"---",null,null,"kg CO2-eq",null,null,"---",null,null,"kg CFC11-eq"]
[null,null,49,{"$f":"Mat_DB!D60","v":0},{"$f":"Mat_DB!H60","v":0},{"$f":"Mat_DB!J60","v":0},{"$f":"Mat_DB!L60","v":0},{"$f":"Mat_DB!K60","v":0},"---","---",{"$f":"Mat_DB!M60","v":0},{"$f":"IF(Mat_DB!O60=\"\",\"---\",Mat_DB!O60)","v":"---"},{"$f":"IF(Mat_DB!P60=\"\",\"---\",Mat_DB!P60)","v":"---"},{"$f":"IF(Mat_DB!Q60=\"\",\"---\",Mat_DB!Q60)","v":"---"},"---",{"$f":"Mat_DB!T60","v":0},"---",{"$f":"Mat_DB!U60","v":0},"---",{"$f":"Mat_DB!V60","v":0},"---",{"$f":"Mat_DB!W60","v":0},"---",{"$f":"Mat_DB!X60","v":0},"---",{"$f":"Mat_DB!Y60","v":0},"---",{"$f":"Mat_DB!Z60","v":0},"---",{"$f":"Mat_DB!AC60","v":0},"---",{"$f":"Mat_DB!AD60","v":0},"---",{"$f":"Mat_DB!AE60","v":0},"---",1,"---","---","---",null,null,null,null,null,null,null,null,null,null,null,null,null,null,null,"Beja",27,null,null,null,null,null,null,null,null,null,null,null,null,null,null,null,null,"ADPF",null,{"$f":"MCA_Inp!J21","v":0.14000000000000001},null,null,null,null,null,null,null,null,null,null,null,null,null,null,null,null,null,null,null,null,null,null,null,null,null,null,null,null,null,null,null,null,null,null,null,null,null,null,null,"SD",null,{"$f":"VLOOKUP($CE$40,$C$9:$AV$61,30)*0.001","v":0.09},{"$f":"VLOOKUP(#REF!,$C$9:$AV$61,7)","v":{"$error":"#REF!"}},{"$f":"VLOOKUP(#REF!,$C$9:$AV$61,7)","v":{"$error":"#REF!"}},null,"F_FL_W",null,{"$f":"DM60/DM62","v":0.3839285714285714},null,null,null,"CHOSEN METHOD",null,{"$f":"SB_UCalc!H26","v":1},null,null,null,null,null,null,null,null,null,null,null,null,null,null,null,null,null,null,null,null,0,1,null,null,null,null,null,null,null,null,null,null,null,null,null,null,null,null,null,null,null,null,null,null,null,null,null,null,null,null,null,null,null,null,"CoP",null,{"$f":"IF($BY$13=1,GD22,GD39)","v":3.5},null,null,{"$f":"IF($BY$33=1,GG22,GG39)","v":3.5},null,null,null,null,null,null,null,null,null,null,null,"LAYER 8",null,"---",null,null,"---",null,null,"---",null,null,"---",null,null,"kg SB-eq",null,null,"---",null,null,"MJ",null,null,"---",null,null,"kg SO2-eq",null,null,"---",null,null,"kg (PO4)3-eq",null,null,"---",null,null,"kg C2H4-eq",null,null,"---",null,null,"kg CO2-eq",null,null,"---",null,null,"kg CFC11-eq"]
[null,null,50,null,null,null,null,null,null,null,null,null,null,null,null,null,null,null,null,null,null,null,null,null,null,null,null,null,null,null,null,null,null,null,null,null,null,null,null,null,null,null,null,null,null,null,null,null,null,null,null,null,null,null,"Belmonte",13,null,null,null,null,null,null,null,null,null,null,null,null,null,null,null,null,"AP",null,{"$f":"MCA_Inp!J22","v":0.14000000000000001},null,null,null,null,null,null,null,null,null,null,null,null,null,null,null,null,null,null,null,null,null,null,null,null,null,null,null,null,null,null,null,null,null,null,null,null,null,null,null,"ST",null,{"$f":"VLOOKUP($CE$40,$C$9:$AV$61,32)*0.001","v":1.5E-3},{"$error":"#REF!"},{"$error":"#REF!"},null,"F_FL_W-",null,{"$f":"1-DS57","v":0.6160714285714286},null,null,null,"CM",null,{"$f":"EH94","v":2.2151044840648018},null,null,null,null,null,null,null,null,null,null,null,null,null,null,null,null,null,null,null,null,0,1,null,null,null,null,null,null,null,null,null,null,null,null,null,null,null,null,null,null,null,null,null,null,null,null,null,null,null,null,null,null,null,null,"EER",null,3.5,null,null,3.5,null,null,"DIFFERENCE",null,null,null,null,null,null,null,null,"LAYER 9",null,"---",null,null,"---",null,null,"---",null,null,"---",null,null,"kg SB-eq",null,null,"---",null,null,"MJ",null,null,"---",null,null,"kg SO2-eq",null,null,"---",null,null,"kg (PO4)3-eq",null,null,"---",null,null,"kg C2H4-eq",null,null,"---",null,null,"kg CO2-eq",null,null,"---",null,null,"kg CFC11-eq"]
[null,null,51,null,null,null,null,null,null,null,null,null,null,null,null,null,null,null,null,null,null,null,null,null,null,null,null,null,null,null,null,null,null,null,null,null,null,null,null,null,null,null,null,null,null,null,null,null,null,null,null,null,null,null,"Benavente",21,null,null,null,null,null,null,null,null,null,null,null,null,null,null,null,null,"EP",null,{"$f":"MCA_Inp!J23","v":0.14000000000000001},null,null,null,null,null,null,null,null,null,null,null,null,null,null,null,null,null,null,null,null,null,null,null,null,null,null,null,null,null,null,null,null,null,null,null,null,null,null,null,"SS",null,{"$f":"CC39*0.001","v":0.4},null,null,null,"F_ST_W",null,{"$f":"DM58/DM62","v":1.339285714285714E-2},null,null,null,"GM1",null,{"$f":"EP94","v":1.9654252953941462},null,null,null,null,null,null,null,null,null,null,null,null,null,null,null,null,null,null,null,null,0,1,null,null,null,null,null,null,null,null,null,null,null,null,null,null,null,null,null,null,null,null,null,null,null,null,null,null,null,null,null,null,null,null,"HUFE",null,4.7676024463689979,null,null,4.0614659458692319,null,null,{"$f":"GD59-GG59","v":0.70613650049976595},null,null,null,null,null,null,null,null,"LAYER 10",null,"---",null,null,"---",null,null,"---",null,null,"---",null,null,"kg SB-eq",null,null,"---",null,null,"MJ",null,null,"---",null,null,"kg SO2-eq",null,null,"---",null,null,"kg (PO4)3-eq",null,null,"---",null,null,"kg C2H4-eq",null,null,"---",null,null,"kg CO2-eq",null,null,"---",null,null,"kg CFC11-eq"]
[null,null,52,null,null,null,null,null,null,null,null,null,null,null,null,null,null,null,null,null,null,null,null,null,null,null,null,null,null,null,null,null,null,null,null,null,null,null,null,null,null,null,null,null,null,null,null,null,null,null,null,null,null,null,"Bombarral",19,null,null,null,null,null,null,null,null,null,null,null,null,null,null,null,null,"POCP",null,{"$f":"MCA_Inp!J24","v":0.14000000000000001},null,null,null,null,null,null,null,null,null,null,null,null,null,null,null,null,null,null,null,null,null,null,null,null,null,null,null,null,null,null,null,null,null,null,null,null,null,null,null,"FL",null,{"$f":"VLOOKUP($CE$40,$C$9:$AV$61,28)*0.001","v":4.3000000000000003E-2},{"$f":"VLOOKUP(#REF!,$C$9:$AV$61,7)","v":{"$error":"#REF!"}},{"$f":"VLOOKUP(#REF!,$C$9:$AV$61,7)","v":{"$error":"#REF!"}},null,"F_ST_W-",null,{"$f":"1-DS59","v":0.9866071428571429},null,null,null,"GM2",null,{"$f":"EX94","v":1.6851870009168648},null,null,null,null,null,null,null,null,null,null,null,null,null,null,null,null,null,null,null,null,0,1,null,null,null,null,null,null,null,null,null,null,null,null,null,null,null,null,null,null,null,null,null,null,null,null,null,null,null,null,null,null,null,null,"HTFE",null,1143.0803625414312,null,null,973.77707518160719,null,null,169.30328735982403,null,null,null,null,null,null,null,null,null,null,null,null,null,null,null,null,null,null,null,{"$f":"SUM(HD39:HF48)+SUM(HD50:HF59)","v":1.0734412955247058E-4},null,null,null,null,null,{"$f":"SUM(HJ39:HL48)+SUM(HJ50:HL59)","v":249.04365294117645},null,null,null,null,null,{"$f":"SUM(HP39:HR48)+SUM(HP50:HR59)","v":5.416941117882354E-2},null,null,null,null,null,{"$f":"SUM(HV39:HX48)+SUM(HV50:HX59)","v":1.0021619341058826E-2},null,null,null,null,null,{"$f":"SUM(IB39:ID48)+SUM(IB50:ID59)","v":1.5195822835294118E-2},null,null,null,null,null,{"$f":"SUM(IH39:IJ48)+SUM(IH50:IJ59)","v":-11.113704014117646},null,null,null,null,null,{"$f":"SUM(IN39:IP48)+SUM(IN50:IP59)","v":2.0773584025882355E-7}]
[null,null,53,null,null,null,null,null,null,null,null,null,null,null,null,null,null,null,null,null,null,null,null,null,null,null,null,null,null,null,null,null,null,null,null,null,null,null,null,null,null,null,null,null,null,null,null,null,null,null,null,null,null,null,"Borba",25,null,null,null,null,null,null,null,null,null,null,null,null,null,null,null,null,"GWP",null,{"$f":"MCA_Inp!J25","v":0.16},null,null,null,null,null,null,null,null,null,null,null,null,null,null,null,null,null,null,null,null,null,null,null,null,null,null,null,null,null,null,null,null,null,null,null,null,null,null,null,"SHT",null,{"$f":"CC41*0.001","v":3.4500000000000003E-2},null,null,null,"F_WZ_SS",null,{"$f":"DM62/DM59","v":0.28000000000000003},null,null,null,"GM3",null,{"$f":"FF94","v":1.7460394573709002},null,null,null,null,null,null,null,null,null,null,null,null,null,null,null,null,null,null,null,null,null,{"$f":"SUM(EU51:EU60)","v":10},null,null,null,null,null,null,null,null,null,null,null,null,null,null,null,null,null,null,null,null,null,null,null,null,null,null,null,null,null,null,null,null,"CUFE",null,1.8176484326781814,null,null,1.5484338918626452,null,null,0.2692145408155362]
[null,null,54,null,null,null,null,null,null,null,null,null,null,null,null,null,null,null,null,null,null,null,null,null,null,null,null,null,null,null,null,null,null,null,null,null,null,null,null,null,null,null,null,null,null,null,null,null,null,null,null,null,null,null,"Boticas",2,null,null,null,null,null,null,null,null,null,null,null,null,null,null,null,null,"ODP",null,{"$f":"MCA_Inp!J26","v":0.14000000000000001},null,null,null,null,null,null,null,null,null,null,null,null,null,null,null,null,null,null,null,null,null,null,null,null,null,null,null,null,null,null,null,null,null,null,null,null,null,null,null,"WZ",null,{"$f":"DM60+2*DM61","v":0.11200000000000002},null,null,null,"F_WZ_SS-",null,{"$f":"1-DS61","v":0.72},null,null,null,"AZM",null,{"$f":"FN94","v":1.9427902478862875},null,null,null,null,null,null,null,null,null,null,null,null,null,null,null,null,null,null,null,null,null,null,null,null,null,null,null,null,null,null,null,null,null,null,null,null,null,null,null,null,null,null,null,null,null,null,null,null,null,null,null,null,null,null,"CTFE",null,435.79938821892085,null,null,371.25250991298788,null,null,64.546878305932978,null,null,null,null,null,null,null,null,"SOLUTION A"]
[null,null,55,null,null,null,null,null,null,null,null,null,null,null,null,null,null,null,null,null,null,null,null,null,null,null,null,null,null,null,null,null,null,null,null,null,null,null,null,null,null,null,null,null,null,null,null,null,null,null,null,null,null,null,"Braga",3,null,null,null,null,null,null,null,null,null,null,null,null,null,null,null,null,null,null,null,null,null,null,null,null,null,null,null,null,null,null,null,null,null,null,null,null,null,null,null,null,null,null,null,null,null,null,null,null,null,null,null,null,null,null,null,null,null,null,"TBW",null,{"$f":"CC42*0.001","v":0.05},null,null,null,"F_TBW_WZ",null,{"$f":"DM63/DM62","v":0.4464285714285714},null,null,null,"R",null,{"$f":"IF(DY57=1,DY58,IF(DY57=2,DY59,IF(DY57=3,DY60,IF(DY57=4,DY61,IF(DY57=5,DY62)))))","v":2.2151044840648018},null,null,null,null,null,null,null,null,null,null,null,null,null,null,null,null,null,null,null,null,null,null,null,null,null,null,null,null,null,null,null,null,null,null,null,null,null,null,null,null,null,null,null,null,null,null,null,null,null,null,null,null,null,null,"UFE",null,6.5852508790471793,null,null,5.6098998377318772,null,null,0.97535104131530215,null,null,"% SAVED ENERGY"]
[null,null,56,null,null,null,null,null,null,null,null,null,null,null,null,null,null,null,null,null,null,null,null,null,null,null,null,null,null,null,null,null,null,null,null,null,null,null,null,null,null,null,null,null,null,null,null,null,null,null,null,null,null,null,"Bragança",2,null,null,null,null,null,null,null,null,null,null,null,null,null,null,null,null,null,null,null,null,null,null,null,null,null,null,null,null,null,null,null,null,null,null,null,null,null,null,null,null,null,null,null,null,null,null,null,null,null,null,null,null,null,null,null,null,null,null,null,null,null,null,null,null,"F_TBW_WZ-",null,{"$f":"1-DS63","v":0.5535714285714286},null,null,null,"U",null,{"$f":"1/DY63","v":0.45144597340390985},null,null,null,null,null,null,null,null,null,null,null,null,null,null,null,null,null,null,null,null,null,null,null,null,null,null,null,null,null,null,null,null,null,null,null,null,null,null,null,null,null,null,null,null,null,null,null,null,null,null,null,null,null,null,"TFE",null,1578.8797507603522,null,null,1345.0295850945949,null,null,233.85016566575723,null,null,{"$f":"1-GG64/GD64","v":0.14811144772307094}]
[null,null,57,null,null,null,null,null,null,null,null,null,null,null,null,null,null,null,null,null,null,null,null,null,null,null,null,null,null,null,null,null,null,null,null,null,null,null,null,null,null,null,null,null,null,null,null,null,null,null,null,null,null,null,"Cabeceiras de Basto",4,null,null,null,null,null,null,null,null,null,null,null,null,null,null,null,null,"MATERIAL 1 LIST",null,null,null,"MATERIAL 2 LIST",null,null,null,"STUD",null,null,null,"TRACK",null,null,null,"MUNICIPALITY LIST",null,null,null,"OTHERS LIST",null,null,null,"λ / R",null,null,null,"Type",null,null,null,"uCons",null,null,null,"Portugal/Others",null,null,null,null,null,null,null,null,null,null,null,"F_ST_SS",null,{"$f":"DM58/DM59","v":3.7499999999999999E-3},null,null,null,null,null,null,null,null,null,null,null,null,null,null,null,null,null,null,null,null,null,null,null,null,null,null,null,null,null,null,null,null,null,null,null,null,null,null,null,null,null,null,null,null,null,null,null,null,null,null,null,null,null,null,null,null,null,null,null,null,null,null,null,null,null,null,null,null,null,null,null,null,null,null,null,null,null,"Layers",null,"Material 1",null,null,"Unit Consumption",null,null,null,null,null,null,"Chosen Indicator"]
[null,null,58,null,null,null,null,null,null,null,null,null,null,null,null,null,null,null,null,null,null,null,null,null,null,null,null,null,null,null,null,null,null,null,null,null,null,null,null,null,null,null,null,null,null,null,null,null,null,null,null,null,null,null,"Cadaval",19,null,null,null,null,null,null,null,null,null,null,null,null,null,null,null,null,null,null,null,null,null,null,null,null,null,null,null,null,null,null,null,null,null,null,null,null,null,null,null,null,null,null,null,null,null,null,null,null,null,null,null,null,null,null,null,null,null,null,null,null,null,null,null,null,"F_ST_SS-",null,{"$f":"1-DS65","v":0.99624999999999997},null,null,null,null,null,null,null,null,null,null,null,null,null,null,null,null,null,null,null,null,null,null,null,null,null,null,null,null,null,null,null,null,null,null,null,null,null,null,null,null,null,null,null,null,null,null,null,null,null,null,null,null,null,null,null,null,null,null,null,null,null,null,null,null,null,null,null,null,null,null,null,null,null,null,null,null,null,"LAYER 1",null,{"$f":"GU12","v":"Gypsum Board (12,5 mm) [Gyptec]"},null,null,{"$f":"IF($HE$67=1,HD12,IF($HE$67=2,HJ12,IF($HE$67=3,HP12,IF($HE$67=4,HV12,IF($HE$67=5,IB12,IF($HE$67=6,IH12,IF($HE$67=7,IN12,0)))))))","v":9.3999999999999997E-4},null,null,{"$f":"IF($HE$67=1,$SV$316,IF($HE$67=2,$SV$317,IF($HE$67=3,$SV$318,IF($HE$67=4,$SV$319,IF($HE$67=5,$SV$320,IF($HE$67=6,$SV$321,IF($HE$67=7,$SV$322,0)))))))","v":"kg C2H4-eq"},{"$f":"VLOOKUP(HB65,$ST$316:$SV$322,2)","v":{"$error":"#N/A"}},{"$f":"VLOOKUP(HC65,$ST$316:$SV$322,2)","v":{"$error":"#N/A"}},null,{"$f":"SA_LCA!H10","v":"Photochemical Ozone Creation Potential (POCP)"}]
[null,null,59,null,null,null,null,null,null,null,null,null,null,null,null,null,null,null,null,null,null,null,null,null,null,null,null,null,null,null,null,null,null,null,null,null,null,null,null,null,null,null,null,null,null,null,null,null,null,null,null,null,null,null,"Caldas da Rainha",19,null,null,null,null,null,null,null,null,null,null,null,null,null,null,null,null,{"$f":"IF(VLOOKUP(C9,$C$9:$AV$61,36)=2,D9,IF(VLOOKUP(C9,$C$9:$AV$61,36)=3,D9,IF(VLOOKUP(C9,$C$9:$AV$61,36)=4,D9,IF(VLOOKUP(C9,$C$9:$AV$61,36)=5,D9,IF(VLOOKUP(C9,$C$9:$AV$61,36)=7,D9,$D$9)))))","v":"---"},null,null,null,{"$f":"IF(VLOOKUP(C9,$C$9:$AV$61,36)=1,D9,IF(VLOOKUP(C9,$C$9:$AV$61,36)=6,D9,$D$9))","v":"---"},null,null,null,{"$f":"IF(VLOOKUP(C9,$C$9:$AV$61,36)=1,D9,$D$9)","v":"---"},null,null,null,{"$f":"IF(VLOOKUP(C9,$C$9:$AV$61,36)=1,D9,$D$9)","v":"---"},null,null,null,"---",null,null,null,{"$f":"IF(Loc_DB!G12=\"\",$BO$9,Loc_DB!G12)","v":"---"},null,null,null,"R [(m²·K)/W]",null,null,null,"LSF Structure (Studs/Tracks)",null,null,null,"m/m²",null,null,null,"1 - Portugal",null,null,null,null,null,null,null,null,null,null,null,"F_TBW_SS",null,{"$f":"DM63/DM59","v":0.125},null,null,null,null,null,null,null,null,null,null,null,null,null,null,null,null,null,null,null,null,null,null,null,null,null,null,null,null,null,null,null,null,null,null,null,null,null,null,null,null,null,null,null,null,null,null,null,null,null,null,null,null,null,null,null,null,null,null,null,null,null,null,null,null,null,null,null,null,null,null,null,null,null,null,null,null,null,"LAYER 2",null,"OSB (12 mm) [Kronospan]",null,null,6.2640000000000005E-3,null,null,"kg C2H4-eq",{"$error":"#N/A"},{"$error":"#N/A"},null,{"$f":"VLOOKUP(HE66,$IM$166:$IN$172,2)","v":5}]
[null,null,60,null,null,null,null,null,null,null,null,null,null,null,null,null,null,null,null,null,null,null,null,null,null,null,null,null,null,null,null,null,null,null,null,null,null,null,null,null,null,null,null,null,null,null,null,null,null,null,null,null,null,null,"Calheta",29,null,null,null,null,null,null,null,null,null,null,null,null,null,null,null,null,{"$f":"IF(VLOOKUP(C10,$C$9:$AV$61,36)=2,D10,IF(VLOOKUP(C10,$C$9:$AV$61,36)=3,D10,IF(VLOOKUP(C10,$C$9:$AV$61,36)=4,D10,IF(VLOOKUP(C10,$C$9:$AV$61,36)=5,D10,IF(VLOOKUP(C10,$C$9:$AV$61,36)=7,D10,$D$9)))))","v":"Gypsum Board (6 mm) [Gyptec]"},null,null,null,{"$f":"IF(VLOOKUP(C10,$C$9:$AV$61,36)=1,D10,IF(VLOOKUP(C10,$C$9:$AV$61,36)=6,D10,$D$9))","v":"---"},null,null,null,{"$f":"IF(VLOOKUP(C10,$C$9:$AV$61,36)=1,D10,$D$9)","v":"---"},null,null,null,{"$f":"IF(VLOOKUP(C10,$C$9:$AV$61,36)=1,D10,$D$9)","v":"---"},null,null,null,"Abrantes",null,null,null,{"$f":"IF(Loc_DB!G14=\"\",$BO$9,Loc_DB!G14)","v":"Helsinki_FI"},null,null,null,"λ [W/(m·K)]",null,null,null,"Cavity Insulation",null,null,null,"m²/m²",null,null,null,"2 - Other Locations",null,null,null,null,null,null,null,null,null,null,null,"F_TBW_SS-",null,{"$f":"1-DS67","v":0.875},null,null,null,null,null,null,null,null,null,null,null,null,null,null,null,null,null,null,null,null,null,null,null,null,null,null,null,null,null,null,null,null,null,null,null,null,null,null,null,null,null,null,null,null,null,null,null,null,null,null,null,null,null,null,null,null,null,null,null,null,null,null,null,null,null,null,null,null,null,null,null,null,null,null,null,null,null,"LAYER 3",null,"Mineral wool (90 mm) [Volcalis]",null,null,6.4619999999999999E-4,null,null,"kg C2H4-eq",{"$error":"#N/A"},{"$error":"#N/A"}]
[null,null,61,null,null,null,null,null,null,null,null,null,null,null,null,null,null,null,null,null,null,null,null,null,null,null,null,null,null,null,null,null,null,null,null,null,null,null,null,null,null,null,null,null,null,null,null,null,null,null,null,null,null,null,"Calheta",30,null,null,null,null,null,null,null,null,null,null,null,null,null,null,null,null,"Gypsum Board (9,5 mm) [Gyptec]",null,null,null,"---",null,null,null,"---",null,null,null,"---",null,null,null,"Águeda",null,null,null,{"$f":"IF(Loc_DB!G15=\"\",$BO$9,Loc_DB!G15)","v":"Minsk_BY"},null,null,null,null,null,null,null,"External Insulation",null,null,null,null,null,null,null,null,null,null,null,null,null,null,null,null,null,null,null,null,null,null,null,null,null,null,null,null,null,null,null,null,null,null,null,null,null,null,null,null,null,null,null,null,null,null,null,null,null,null,null,null,null,null,null,null,null,null,null,null,null,null,null,null,null,null,null,null,null,null,null,null,null,null,null,null,null,null,null,null,null,null,null,null,null,null,null,null,null,null,null,null,null,null,null,null,null,null,null,"LAYER 4",null,"OSB (12 mm) [Kronospan]",null,null,6.2640000000000005E-3,null,null,"kg C2H4-eq",{"$error":"#N/A"},{"$error":"#N/A"}]
[null,null,62,null,null,null,null,null,null,null,null,null,null,null,null,null,null,null,null,null,null,null,null,null,null,null,null,null,null,null,null,null,null,null,null,null,null,null,null,null,null,null,null,null,null,null,null,null,null,null,null,null,null,null,"Câmara de Lobos",30,null,null,null,null,null,null,null,null,null,null,null,null,null,null,null,null,"Gypsum Board (12,5 mm) [Gyptec]",null,null,null,"---",null,null,null,"---",null,null,null,"---",null,null,null,"Aguiar da Beira",null,null,null,{"$f":"IF(Loc_DB!G16=\"\",$BO$9,Loc_DB!G16)","v":"Oslo_NO"},null,null,null,null,null,null,null,"Other",null,null,null,null,null,null,null,null,null,null,null,null,null,null,null,null,null,null,null,null,null,null,null,null,null,null,null,null,null,null,null,null,null,null,null,null,null,null,null,null,null,null,null,null,null,null,null,null,null,null,null,null,null,null,null,null,null,null,null,null,null,null,null,null,null,null,null,null,null,null,null,null,null,null,null,null,null,null,null,null,null,null,null,null,null,null,null,null,null,null,null,null,null,null,null,null,null,null,null,"LAYER 5",null,"Mortar (10 mm)",null,null,2.4499999999999999E-4,null,null,"kg C2H4-eq",{"$error":"#N/A"},{"$error":"#N/A"}]
[null,null,null,null,null,null,null,null,null,null,null,null,null,null,null,null,null,null,null,null,null,null,null,null,null,null,null,null,null,null,null,null,null,null,null,null,null,null,null,null,null,null,null,null,null,null,null,null,null,null,null,null,null,null,"Caminha",1,null,null,null,null,null,null,null,null,null,null,null,null,null,null,null,null,"Gypsum Board (15 mm) [Gyptec]",null,null,null,"---",null,null,null,"---",null,null,null,"---",null,null,null,"Alandroal",null,null,null,{"$f":"IF(Loc_DB!G17=\"\",$BO$9,Loc_DB!G17)","v":"Stockholm_SE"},null,null,null,null,null,null,null,"Sheathing Panel",null,null,null,null,null,null,null,null,null,null,null,null,null,null,null,null,null,null,null,null,null,null,null,null,null,null,null,null,null,null,null,null,"ISO 6946 COMBINED METHOD",null,null,null,null,null,null,null,"GORGOLEWSKI METHOD 1",null,null,null,null,null,null,null,"GORGOLEWSKI METHOD 2",null,null,null,null,null,null,null,"GORGOLEWSKI METHOD 3",null,null,null,null,null,null,null,"ASHRAE ZONE METHOD",null,null,null,null,null,null,null,"ASHRAE ZONE METHOD",null,null,null,null,null,null,null,null,null,null,null,null,null,null,null,null,null,null,null,null,null,null,null,null,null,null,"LAYER 6",null,"---",null,null,"---",null,null,"kg C2H4-eq",{"$error":"#N/A"},{"$error":"#N/A"}]
[null,null,null,null,null,null,null,null,null,null,null,null,null,null,null,null,null,null,null,null,null,null,null,null,null,null,null,null,null,null,null,null,null,null,null,null,null,null,null,null,null,null,null,null,null,null,null,null,null,null,null,null,null,null,"Campo Maior",24,null,null,null,null,null,null,null,null,null,null,null,null,null,null,null,null,"Gypsum Board (18 mm) [Gyptec]",null,null,null,"---",null,null,null,"---",null,null,null,"---",null,null,null,"Albergaria-a-Velha",null,null,null,{"$f":"IF(Loc_DB!G18=\"\",$BO$9,Loc_DB!G18)","v":"Berlin_DE"},null,null,null,null,null,null,null,"Thermal Break Strip",null,null,null,"LIST",null,null,null,null,null,null,null,null,null,null,null,null,null,null,null,null,null,null,null,null,null,null,null,null,null,null,null,null,null,null,null,null,null,null,null,null,null,null,null,null,null,null,null,null,null,null,null,null,null,null,null,null,null,null,null,null,null,null,null,null,null,null,null,null,null,null,null,null,null,null,null,null,null,null,null,null,null,null,null,null,null,null,null,null,null,null,null,null,null,null,null,null,null,null,null,"LAYER 7",null,"---",null,null,"---",null,null,"kg C2H4-eq",{"$error":"#N/A"},{"$error":"#N/A"}]
[null,null,null,null,null,null,null,null,null,null,null,null,null,null,null,null,null,null,null,null,null,null,null,null,null,null,null,null,null,null,null,null,null,null,null,null,null,null,null,null,null,null,null,null,null,null,null,null,null,null,null,null,null,null,"Cantanhede",10,null,null,null,null,null,null,null,null,null,null,null,null,null,null,null,null,"OSB (9 mm) [Kronospan]",null,null,null,"---",null,null,null,"---",null,null,null,"---",null,null,null,"Albufeira",null,null,null,{"$f":"IF(Loc_DB!G19=\"\",$BO$9,Loc_DB!G19)","v":"Brussels_BE"},null,null,null,null,null,null,null,"Air Cavity",null,null,null,null,null,null,null,null,null,null,null,null,null,null,null,null,null,null,null,null,null,null,null,null,null,null,null,null,null,null,null,null,null,null,null,null,null,null,null,null,null,null,null,null,null,null,null,null,null,null,null,null,null,null,null,null,null,null,null,null,null,null,null,null,null,null,null,null,null,null,null,null,null,null,null,null,null,null,null,null,null,null,null,null,null,null,null,null,null,null,null,null,null,null,null,null,null,null,null,"LAYER 8",null,"---",null,null,"---",null,null,"kg C2H4-eq",{"$error":"#N/A"},{"$error":"#N/A"}]
[null,null,null,null,null,null,null,null,null,null,null,null,null,null,null,null,null,null,null,null,null,null,null,null,null,null,null,null,null,null,null,null,null,null,null,null,null,null,null,null,null,null,null,null,null,null,null,null,null,null,null,null,null,null,"Carrazeda de Ansiães",7,null,null,null,null,null,null,null,null,null,null,null,null,null,null,null,null,"OSB (12 mm) [Kronospan]",null,null,null,"---",null,null,null,"---",null,null,null,"---",null,null,null,"Alcácer do Sal",null,null,null,{"$f":"IF(Loc_DB!G20=\"\",$BO$9,Loc_DB!G20)","v":"Vienna_AT"},null,null,null,null,null,null,null,null,null,null,null,"ASHRAE Zone Method",null,null,null,null,null,null,null,null,null,null,null,null,null,null,null,null,null,null,null,null,null,null,null,null,null,null,null,null,"PARALLEL PATH METHOD",null,null,null,"ISOTHERMAL PLANE METHOD",null,null,null,"PARALLEL PATH METHOD",null,null,null,"ISOTHERMAL PLANE METHOD",null,null,null,"PARALLEL PATH METHOD",null,null,null,"ISOTHERMAL PLANE METHOD",null,null,null,"PARALLEL PATH METHOD",null,null,null,"ISOTHERMAL PLANE METHOD",null,null,null,"Zone CAV",null,null,null,"Zone W",null,null,null,"Zone CAV",null,null,null,"Zone W",null,null,null,null,null,null,null,null,null,null,null,null,null,null,null,null,null,null,null,null,null,null,"LAYER 9",null,"---",null,null,"---",null,null,"kg C2H4-eq",{"$error":"#N/A"},{"$error":"#N/A"}]
[null,null,null,null,null,null,null,null,null,null,null,null,null,null,null,null,null,null,null,null,null,null,null,null,null,null,null,null,null,null,null,null,null,null,null,null,null,null,null,null,null,null,null,null,null,null,null,null,null,null,null,null,null,null,"Carregal do Sal",15,null,null,null,null,null,null,null,null,null,null,null,null,null,null,null,null,"OSB (15 mm) [Kronospan]",null,null,null,"---",null,null,null,"---",null,null,null,"---",null,null,null,"Alcanena",null,null,null,{"$f":"IF(Loc_DB!G21=\"\",$BO$9,Loc_DB!G21)","v":"London_GB"},null,null,null,null,null,null,null,null,null,null,null,"Gorgolewski Method 1",null,null,null,null,null,null,null,null,null,null,null,null,null,null,null,null,null,null,null,null,null,null,null,null,null,null,null,null,"Path A",null,"Path B",null,null,null,null,null,"Path A",null,"Path B",null,null,null,null,null,"Path A",null,"Path B",null,null,null,null,null,"Path A",null,"Path B",null,null,null,null,null,null,null,null,null,null,null,null,null,null,null,null,null,null,null,null,null,null,null,null,null,null,null,null,null,null,null,null,null,null,null,null,null,null,null,null,"LAYER 10",null,"---",null,null,"---",null,null,"kg C2H4-eq",{"$error":"#N/A"},{"$error":"#N/A"}]
[null,null,null,null,null,null,null,null,null,null,null,null,null,null,null,null,null,null,null,null,null,null,null,null,null,null,null,null,null,null,null,null,null,null,null,null,null,null,null,null,null,null,null,null,null,null,null,null,null,null,null,null,null,null,"Cartaxo",21,null,null,null,null,null,null,null,null,null,null,null,null,null,null,null,null,"OSB (18 mm) [Kronospan]",null,null,null,"---",null,null,null,"---",null,null,null,"---",null,null,null,"Alcobaça",null,null,null,{"$f":"IF(Loc_DB!G22=\"\",$BO$9,Loc_DB!G22)","v":"Prague_CZ"},null,null,null,null,null,null,null,null,null,null,null,"Gorgolewski Method 2",null,null,null,null,null,null,null,null,null,null,null,"e","lambda 1","lambda 1'","lambda 2","lambda 2'","r 1","r 2","R1","R2","Ref. 1","Ref. 2","W-Met-1","W-Met-2","W-Met-1","Sum","W-TB","Rsi",0.13,null,0.13,null,null,0.13,null,null,{"$f":"ED76","v":0.13},null,{"$f":"EF76","v":0.13},null,null,{"$f":"EI76","v":0.13},null,null,{"$f":"ED76","v":0.13},null,{"$f":"EF76","v":0.13},null,null,{"$f":"EI76","v":0.13},null,null,{"$f":"ED76","v":0.13},null,{"$f":"EF76","v":0.13},null,null,{"$f":"EI76","v":0.13},null,null,null,{"$f":"ED76","v":0.13},null,null,null,{"$f":"EI76","v":0.13},null,null,null,{"$f":"$AH$13","v":"---"},null,null,null,{"$f":"$AH$13","v":"---"},null,null,null,null,null,null,null,null,null,null,null,null,null,null,null,null,null,null,null,null,null,null,null,"Material 2",null,null,"Unit Consumption"]
[null,null,null,null,null,null,null,null,null,null,null,null,null,null,null,null,null,null,null,null,null,null,null,null,null,null,null,null,null,null,null,null,null,null,null,null,null,null,null,null,null,null,null,null,null,null,null,null,null,null,null,null,null,null,"Cascais",22,null,null,null,null,null,null,null,null,null,null,null,null,null,null,null,null,"OSB (22 mm) [Kronospan]",null,null,null,"---",null,null,null,"---",null,null,null,"---",null,null,null,"Alcochete",null,null,null,{"$f":"IF(Loc_DB!G23=\"\",$BO$9,Loc_DB!G23)","v":"Athens_GR"},null,null,null,null,null,null,null,null,null,null,null,"Gorgolewski Method 3",null,null,null,null,null,null,null,null,null,"LAYER 1",null,{"$f":"(VLOOKUP(CO34,$C$9:$AV$61,4))","v":12.5},{"$f":"VLOOKUP(CO34,$C$9:$AV$61,7)","v":0.17499999999999999},{"$f":"DM77*0.001/DR77","v":0.17499999999999999},{"$f":"VLOOKUP(CX34,$C$9:$AV$61,7)","v":"---"},{"$f":"DM77*0.001/DS77","v":{"$error":"#VALUE!"}},{"$f":"DT77","v":7.1428571428571438E-2},{"$f":"IF(VLOOKUP(CX34,$C$9:$AV$61,35)=2,(DM77*0.001)/DP77,VLOOKUP(CX34,$C$9:$AV$61,8))","v":"---"},{"$f":"AX38","v":7.1428571428571438E-2},{"$f":"IF(VLOOKUP(CX34,$C$9:$AV$61,35)=0,DT77,DS77)","v":7.1428571428571438E-2},{"$f":"VLOOKUP(CO34,$C$9:$AV$61,9)","v":"Gyptec"},{"$f":"VLOOKUP(CX34,$C$9:$AV$61,9)","v":"---"},{"$f":"1/($DS$12/($DM$57/DQ77)+$DS$13/($DM$57/DO77))","v":{"$error":"#VALUE!"}},{"$f":"1/($DS$59/(($DM$57-2*$DM$58)/DQ77)+$DS$60/(($DM$57-2*$DM$58)/DO77))","v":{"$error":"#VALUE!"}},{"$f":"1/($DS$12/($DM$57/DQ77)+$DS$13/($DM$57/DO77))","v":{"$error":"#VALUE!"}},{"$f":"DX77+DY77+DZ77","v":{"$error":"#VALUE!"}},{"$f":"1/($DS$63/DU77+$DS$64/DT77)","v":7.1428571428571438E-2},null,{"$f":"DT77","v":7.1428571428571438E-2},null,{"$f":"DU77","v":7.1428571428571438E-2},null,null,{"$f":"IF(VLOOKUP(CX34,$C$9:$AV$61,36)=1,1/(($DS$66/ED77)+($DS$65/EF77)),IF(VLOOKUP(CX34,$C$9:$AV$61,36)=6,1/(($DS$68/ED77)+($DS$67/EF77)),ED77))","v":7.1428571428571438E-2},null,null,7.1428571428571438E-2,null,7.1428571428571438E-2,null,null,7.1428571428571438E-2,null,null,7.1428571428571438E-2,null,7.1428571428571438E-2,null,null,7.1428571428571438E-2,null,null,7.1428571428571438E-2,null,7.1428571428571438E-2,null,null,7.1428571428571438E-2,null,null,null,{"$f":"ED77","v":7.1428571428571438E-2},null,null,null,{"$f":"IF(VLOOKUP(CX34,$C$9:$AV$61,36)=1,EA77,IF(VLOOKUP(CX34,$C$9:$AV$61,36)=6,EB77,FK77))","v":7.1428571428571438E-2},null,null,null,{"$f":"EL77","v":7.1428571428571438E-2},null,null,null,{"$f":"IF(EB77=EC77,EB77,IF(VLOOKUP(#REF!,#REF!,11)=1,#REF!,IF(VLOOKUP(#REF!,#REF!,11)=2,#REF!,0)))","v":{"$error":"#REF!"}},null,null,null,null,null,null,null,null,null,null,null,null,null,null,null,null,null,null,null,null,null,"LAYER 1",null,{"$f":"GU23","v":"---"},null,null,{"$f":"IF($HE$67=1,HD23,IF($HE$67=2,HJ23,IF($HE$67=3,HP23,IF($HE$67=4,HV23,IF($HE$67=5,IB23,IF($HE$67=6,IH23,IF($HE$67=7,IN23,0)))))))","v":"---"},null,null,{"$f":"IF($HE$67=1,$SV$316,IF($HE$67=2,$SV$317,IF($HE$67=3,$SV$318,IF($HE$67=4,$SV$319,IF($HE$67=5,$SV$320,IF($HE$67=6,$SV$321,IF($HE$67=7,$SV$322,0)))))))","v":"kg C2H4-eq"},{"$f":"VLOOKUP(HB76,$ST$316:$SV$322,2)","v":{"$error":"#N/A"}},{"$f":"VLOOKUP(HC76,$ST$316:$SV$322,2)","v":{"$error":"#N/A"}}]
[null,null,null,null,null,null,null,null,null,null,null,null,null,null,null,null,null,null,null,null,null,null,null,null,null,null,null,null,null,null,null,null,null,null,null,null,null,null,null,null,null,null,null,null,null,null,null,null,null,null,null,null,null,null,"Castanheira de Pera",16,null,null,null,null,null,null,null,null,null,null,null,null,null,null,null,null,"OSB (25 mm) [Kronospan]",null,null,null,"---",null,null,null,{"$f":"IF(VLOOKUP(C20,$C$9:$AV$61,36)=1,D20,$D$9)","v":"---"},null,null,null,"---",null,null,null,"Alcoutim",null,null,null,{"$f":"IF(Loc_DB!G24=\"\",$BO$9,Loc_DB!G24)","v":"Coimbra_PT"},null,null,null,null,null,null,null,null,null,null,null,"ISO 6946 Combined Method",null,null,null,null,null,null,null,null,null,"LAYER 2",null,12,0.13,0.13,"---",{"$error":"#VALUE!"},9.2307692307692313E-2,"---",9.2307692307692313E-2,9.2307692307692313E-2,"Kronospan","---",{"$f":"1/($DS$12/($DM$57/DQ78)+$DS$13/($DM$57/DO78))","v":{"$error":"#VALUE!"}},{"$error":"#VALUE!"},{"$f":"1/($DS$12/($DM$57/DQ78)+$DS$13/($DM$57/DO78))","v":{"$error":"#VALUE!"}},{"$error":"#VALUE!"},9.2307692307692313E-2,null,9.2307692307692313E-2,null,9.2307692307692313E-2,null,null,9.2307692307692313E-2,null,null,9.2307692307692313E-2,null,9.2307692307692313E-2,null,null,9.2307692307692313E-2,null,null,9.2307692307692313E-2,null,9.2307692307692313E-2,null,null,9.2307692307692313E-2,null,null,9.2307692307692313E-2,null,9.2307692307692313E-2,null,null,9.2307692307692313E-2,null,null,null,9.2307692307692313E-2,null,null,null,9.2307692307692313E-2,null,null,null,9.2307692307692313E-2,null,null,null,{"$f":"IF(EB78=EC78,EB78,IF(VLOOKUP(#REF!,#REF!,11)=1,#REF!,IF(VLOOKUP(#REF!,#REF!,11)=2,#REF!,0)))","v":{"$error":"#REF!"}},null,null,null,null,null,null,null,null,null,null,null,null,null,null,null,null,null,null,null,null,null,"LAYER 2",null,"---",null,null,"---",null,null,"kg C2H4-eq",{"$error":"#N/A"},{"$error":"#N/A"}]
[null,null,null,null,null,null,null,null,null,null,null,null,null,null,null,null,null,null,null,null,null,null,null,null,null,null,null,null,null,null,null,null,null,null,null,null,null,null,null,null,null,null,null,null,null,null,null,null,null,null,null,null,null,null,"Castelo Branco",12,null,null,null,null,null,null,null,null,null,null,null,null,null,null,null,null,"Mineral wool (10 mm) [Volcalis]",null,null,null,"---",null,null,null,"---",null,null,null,"---",null,null,null,"Alenquer",null,null,null,{"$f":"IF(Loc_DB!G25=\"\",$BO$9,Loc_DB!G25)","v":"Madrid_SP"},null,null,null,null,null,null,null,null,null,null,null,null,null,null,null,null,null,null,null,null,null,"LAYER 3",null,10,"---",6.6666666666666666E-2,3.5000000000000003E-2,3.5000000000000003E-2,0.15,0.2857142857142857,0.15,0.2857142857142857,"ISO 6946","IFoam",{"$f":"1/($DS$12/($DM$57/DQ79)+$DS$13/($DM$57/DO79))","v":1.7352427523576668},1.3133550488599348,{"$f":"1/($DS$12/($DM$57/DQ79)+$DS$13/($DM$57/DO79))","v":1.7352427523576668},4.7838405535752688,0.19036827195467421,null,0.15,null,0.2857142857142857,null,null,{"$f":"IF(VLOOKUP(CX36,$C$9:$AV$61,36)=1,1/(($DS$66/ED79)+($DS$65/EF79)),IF(VLOOKUP(CX36,$C$9:$AV$61,36)=6,1/(($DS$68/ED79)+($DS$67/EF79)),ED79))","v":0.15946843853820597},null,null,0.15,null,0.2857142857142857,null,null,0.15946843853820597,null,null,0.15,null,0.2857142857142857,null,null,0.15946843853820597,null,null,0.15,null,0.2857142857142857,null,null,0.15946843853820597,null,null,null,0.15,null,null,null,0.19036827195467421,null,null,null,0.15,null,null,null,{"$f":"IF(EB79=EC79,EB79,IF(VLOOKUP(#REF!,#REF!,11)=1,#REF!,IF(VLOOKUP(#REF!,#REF!,11)=2,#REF!,0)))","v":{"$error":"#REF!"}},null,null,null,null,null,null,null,null,null,null,null,null,null,null,null,null,null,null,null,null,null,"LAYER 3",null,"Steel C90/U93 (90 mm) [Pertecno]",null,null,4.6603460000000003E-4,null,null,"kg C2H4-eq",{"$error":"#N/A"},{"$error":"#N/A"}]
[null,null,null,null,null,null,null,null,null,null,null,null,null,null,null,null,null,null,null,null,null,null,null,null,null,null,null,null,null,null,null,null,null,null,null,null,null,null,null,null,null,null,null,null,null,null,null,null,null,null,null,null,null,null,"Castelo de Paiva",6,null,null,null,null,null,null,null,null,null,null,null,null,null,null,null,null,"Mineral wool (50 mm) [Volcalis]",null,null,null,"---",null,null,null,"---",null,null,null,"---",null,null,null,"Alfândega da Fé",null,null,null,{"$f":"IF(Loc_DB!G26=\"\",$BO$9,Loc_DB!G26)","v":"Marseille_FR"},null,null,null,null,null,null,null,null,null,null,null,null,null,null,null,null,null,null,null,null,null,"LAYER 4",null,90,3.5000000000000003E-2,3.5000000000000003E-2,50,50,2.5714285714285712,1.8E-3,2.5714285714285712,1.8E-3,"Volcalis","Pertecno",3.8480932651396679E-3,{"$f":"1/($DS$59/(($DM$57-2*$DM$58)/DQ80)+$DS$60/(($DM$57-2*$DM$58)/DO80))","v":0.12354899039528323},3.8480932651396679E-3,0.13124517692556256,{"$f":"1/($DS$63/DU80+$DS$64/DT80)","v":4.0285032591710398E-3},null,2.5714285714285712,null,1.8E-3,null,null,{"$f":"IF(VLOOKUP(CX37,$C$9:$AV$61,36)=1,1/(($DS$66/ED80)+($DS$65/EF80)),IF(VLOOKUP(CX37,$C$9:$AV$61,36)=6,1/(($DS$68/ED80)+($DS$67/EF80)),ED80))","v":0.4047331290930043},null,null,2.5714285714285712,null,1.8E-3,null,null,0.4047331290930043,null,null,2.5714285714285712,null,1.8E-3,null,null,0.4047331290930043,null,null,2.5714285714285712,null,1.8E-3,null,null,0.4047331290930043,null,null,null,2.5714285714285712,null,null,null,{"$f":"IF(VLOOKUP(CX37,$C$9:$AV$61,36)=1,EA80,IF(VLOOKUP(CX37,$C$9:$AV$61,36)=6,EB80,FK80))","v":0.13124517692556256},null,null,null,2.5714285714285712,null,null,null,{"$f":"IF(EB80=EC80,EB80,IF(VLOOKUP(#REF!,#REF!,11)=1,#REF!,IF(VLOOKUP(#REF!,#REF!,11)=2,#REF!,0)))","v":{"$error":"#REF!"}},null,null,null,null,null,null,null,null,null,null,null,null,null,null,null,null,null,null,null,null,null,"LAYER 4",null,"---",null,null,"---",null,null,"kg C2H4-eq",{"$error":"#N/A"},{"$error":"#N/A"}]
[null,null,null,null,null,null,null,null,null,null,null,null,null,null,null,null,null,null,null,null,null,null,null,null,null,null,null,null,null,null,null,null,null,null,null,null,null,null,null,null,null,null,null,null,null,null,null,null,null,null,null,null,null,null,"Castelo de Vide",24,null,null,null,null,null,null,null,null,null,null,null,null,null,null,null,null,"Mineral wool (90 mm) [Volcalis]",null,null,null,"---",null,null,null,"---",null,null,null,"---",null,null,null,"Alijó",null,null,null,{"$f":"IF(Loc_DB!G27=\"\",$BO$9,Loc_DB!G27)","v":"Rome_IT"},null,null,null,null,null,null,null,null,null,null,null,null,null,null,null,null,null,null,null,null,null,"LAYER 5",null,10,"---",6.6666666666666666E-2,3.5000000000000003E-2,3.5000000000000003E-2,0.15,0.2857142857142857,0.15,0.2857142857142857,"ISO 6946","IFoam",1.7352427523576668,1.3133550488599348,1.7352427523576668,4.7838405535752688,{"$f":"1/($DS$63/DU81+$DS$64/DT81)","v":0.19036827195467421},null,0.15,null,0.2857142857142857,null,null,0.15946843853820597,null,null,0.15,null,0.2857142857142857,null,null,0.15946843853820597,null,null,0.15,null,0.2857142857142857,null,null,0.15946843853820597,null,null,0.15,null,0.2857142857142857,null,null,0.15946843853820597,null,null,null,0.15,null,null,null,{"$f":"IF(VLOOKUP(CX38,$C$9:$AV$61,36)=1,EA81,IF(VLOOKUP(CX38,$C$9:$AV$61,36)=6,EB81,FK81))","v":0.19036827195467421},null,null,null,0.15,null,null,null,{"$f":"IF(EB81=EC81,EB81,IF(VLOOKUP(#REF!,#REF!,11)=1,#REF!,IF(VLOOKUP(#REF!,#REF!,11)=2,#REF!,0)))","v":{"$error":"#REF!"}},null,null,null,null,null,null,null,null,null,null,null,null,null,null,null,null,null,null,null,null,null,"LAYER 5",null,"---",null,null,"---",null,null,"kg C2H4-eq",{"$error":"#N/A"},{"$error":"#N/A"}]
[null,null,null,null,null,null,null,null,null,null,null,null,null,null,null,null,null,null,null,null,null,null,null,null,null,null,null,null,null,null,null,null,null,null,null,null,null,null,null,null,null,null,null,null,null,null,null,null,null,null,null,null,null,null,"Castro Daire",15,null,null,null,null,null,null,null,null,null,null,null,null,null,null,null,null,"Mineral wool (100 mm) [Volcalis]",null,null,null,"---",null,null,null,"---",null,null,null,"---",null,null,null,"Aljezur",null,null,null,{"$f":"IF(Loc_DB!#REF!=\"\",$BO$9,Loc_DB!#REF!)","v":{"$error":"#REF!"}},null,null,null,null,null,null,null,null,null,null,null,null,null,null,null,null,null,null,null,null,null,"LAYER 6",null,12,0.13,0.13,"---",{"$error":"#VALUE!"},9.2307692307692313E-2,"---",9.2307692307692313E-2,9.2307692307692313E-2,"Kronospan","---",{"$error":"#VALUE!"},{"$error":"#VALUE!"},{"$error":"#VALUE!"},{"$error":"#VALUE!"},9.2307692307692313E-2,null,9.2307692307692313E-2,null,9.2307692307692313E-2,null,null,9.2307692307692313E-2,null,null,9.2307692307692313E-2,null,9.2307692307692313E-2,null,null,9.2307692307692313E-2,null,null,9.2307692307692313E-2,null,9.2307692307692313E-2,null,null,9.2307692307692313E-2,null,null,9.2307692307692313E-2,null,9.2307692307692313E-2,null,null,9.2307692307692313E-2,null,null,null,9.2307692307692313E-2,null,null,null,9.2307692307692313E-2,null,null,null,9.2307692307692313E-2,null,null,null,{"$f":"IF(EB82=EC82,EB82,IF(VLOOKUP(#REF!,#REF!,11)=1,#REF!,IF(VLOOKUP(#REF!,#REF!,11)=2,#REF!,0)))","v":{"$error":"#REF!"}},null,null,null,null,null,null,null,null,null,null,null,null,null,null,null,null,null,null,null,null,null,"LAYER 6",null,"---",null,null,"---",null,null,"kg C2H4-eq",{"$error":"#N/A"},{"$error":"#N/A"}]
[null,null,null,null,null,null,null,null,null,null,null,null,null,null,null,null,null,null,null,null,null,null,null,null,null,null,null,null,null,null,null,null,null,null,null,null,null,null,null,null,null,null,null,null,null,null,null,null,null,null,null,null,null,null,"Castro Marim",28,null,null,null,null,null,null,null,null,null,null,null,null,null,null,null,null,"Mineral wool (120 mm) [Volcalis]",null,null,null,"---",null,null,null,"---",null,null,null,"---",null,null,null,"Aljustrel",null,null,null,{"$f":"IF(Loc_DB!G28=\"\",$BO$9,Loc_DB!G28)","v":"---"},null,null,null,null,null,null,null,null,null,null,null,null,null,null,null,null,null,null,null,null,null,"LAYER 7",null,10,1.8,1.8,"---",{"$error":"#VALUE!"},5.5555555555555558E-3,"---",5.5555555555555558E-3,5.5555555555555558E-3,"ITE50","---",{"$error":"#VALUE!"},{"$error":"#VALUE!"},{"$error":"#VALUE!"},{"$error":"#VALUE!"},5.5555555555555558E-3,null,5.5555555555555558E-3,null,5.5555555555555558E-3,null,null,5.5555555555555558E-3,null,null,5.5555555555555558E-3,null,5.5555555555555558E-3,null,null,5.5555555555555558E-3,null,null,5.5555555555555558E-3,null,5.5555555555555558E-3,null,null,5.5555555555555558E-3,null,null,5.5555555555555558E-3,null,5.5555555555555558E-3,null,null,5.5555555555555558E-3,null,null,null,5.5555555555555558E-3,null,null,null,5.5555555555555558E-3,null,null,null,5.5555555555555558E-3,null,null,null,{"$f":"IF(EB83=EC83,EB83,IF(VLOOKUP(#REF!,#REF!,11)=1,#REF!,IF(VLOOKUP(#REF!,#REF!,11)=2,#REF!,0)))","v":{"$error":"#REF!"}},null,null,null,null,null,null,null,null,null,null,null,null,null,null,null,null,null,null,null,null,null,"LAYER 7",null,"---",null,null,"---",null,null,"kg C2H4-eq",{"$error":"#N/A"},{"$error":"#N/A"}]
[null,null,null,null,null,null,null,null,null,null,null,null,null,null,null,null,null,null,null,null,null,null,null,null,null,null,null,null,null,null,null,null,null,null,null,null,null,null,null,null,null,null,null,null,null,null,null,null,null,null,null,null,null,null,"Castro Verde",27,null,null,null,null,null,null,null,null,null,null,null,null,null,null,null,null,"Mineral wool (200 mm) [Volcalis]",null,null,null,"---",null,null,null,"---",null,null,null,"---",null,null,null,"Almada",null,null,null,{"$f":"IF(Loc_DB!G29=\"\",$BO$9,Loc_DB!G29)","v":"---"},null,null,null,null,null,null,null,null,null,null,null,null,null,null,null,null,null,null,null,null,null,"LAYER 8",null,"---","---",{"$error":"#VALUE!"},"---",{"$error":"#VALUE!"},"---","---","---","---","---","---",{"$error":"#VALUE!"},{"$error":"#VALUE!"},{"$error":"#VALUE!"},{"$error":"#VALUE!"},{"$error":"#VALUE!"},null,"---",null,"---",null,null,"---",null,null,"---",null,"---",null,null,"---",null,null,"---",null,"---",null,null,"---",null,null,"---",null,"---",null,null,"---",null,null,null,"---",null,null,null,"---",null,null,null,"---",null,null,null,{"$f":"IF(EB84=EC84,EB84,IF(VLOOKUP(#REF!,#REF!,11)=1,#REF!,IF(VLOOKUP(#REF!,#REF!,11)=2,#REF!,0)))","v":{"$error":"#VALUE!"}},null,null,null,null,null,null,null,null,null,null,null,null,null,null,null,null,null,null,null,null,null,"LAYER 8",null,"---",null,null,"---",null,null,"kg C2H4-eq",{"$error":"#N/A"},{"$error":"#N/A"}]
[null,null,null,null,null,null,null,null,null,null,null,null,null,null,null,null,null,null,null,null,null,null,null,null,null,null,null,null,null,null,null,null,null,null,null,null,null,null,null,null,null,null,null,null,null,null,null,null,null,null,null,null,null,null,"Celorico da Beira",11,null,null,null,null,null,null,null,null,null,null,null,null,null,null,null,null,"ETICS EPS (40 mm) [Weber]",null,null,null,"---",null,null,null,"---",null,null,null,"---",null,null,null,"Almeida",null,null,null,{"$f":"IF(Loc_DB!G30=\"\",$BO$9,Loc_DB!G30)","v":"---"},null,null,null,null,null,null,null,null,null,null,null,null,null,null,null,null,null,null,null,null,null,"LAYER 9",null,"---","---",{"$error":"#VALUE!"},"---",{"$error":"#VALUE!"},"---","---","---","---","---","---",{"$error":"#VALUE!"},{"$error":"#VALUE!"},{"$error":"#VALUE!"},{"$error":"#VALUE!"},{"$error":"#VALUE!"},null,"---",null,"---",null,null,"---",null,null,"---",null,"---",null,null,"---",null,null,"---",null,"---",null,null,"---",null,null,"---",null,"---",null,null,"---",null,null,null,"---",null,null,null,"---",null,null,null,"---",null,null,null,{"$f":"IF(EB85=EC85,EB85,IF(VLOOKUP(#REF!,#REF!,11)=1,#REF!,IF(VLOOKUP(#REF!,#REF!,11)=2,#REF!,0)))","v":{"$error":"#VALUE!"}},null,null,null,null,null,null,null,null,null,null,null,null,null,null,null,null,null,null,null,null,null,"LAYER 9",null,"---",null,null,"---",null,null,"kg C2H4-eq",{"$error":"#N/A"},{"$error":"#N/A"}]
[null,null,null,null,null,null,null,null,null,null,null,null,null,null,null,null,null,null,null,null,null,null,null,null,null,null,null,null,null,null,null,null,null,null,null,null,null,null,null,null,null,null,null,null,null,null,null,null,null,null,null,null,null,null,"Celorico de Basto",6,null,null,null,null,null,null,null,null,null,null,null,null,null,null,null,null,"ETICS EPS (50 mm) [Weber]",null,null,null,"---",null,null,null,{"$f":"IF(VLOOKUP(C28,$C$9:$AV$61,36)=1,D28,$D$9)","v":"---"},null,null,null,"---",null,null,null,"Almeirim",null,null,null,{"$f":"IF(Loc_DB!G31=\"\",$BO$9,Loc_DB!G31)","v":"---"},null,null,null,null,null,null,null,null,null,null,null,null,null,null,null,null,null,null,null,null,null,"LAYER 10",null,"---","---",{"$error":"#VALUE!"},"---",{"$error":"#VALUE!"},"---","---","---","---","---","---",{"$error":"#VALUE!"},{"$error":"#VALUE!"},{"$error":"#VALUE!"},{"$error":"#VALUE!"},{"$error":"#VALUE!"},null,"---",null,"---",null,null,"---",null,null,"---",null,"---",null,null,"---",null,null,"---",null,"---",null,null,"---",null,null,"---",null,"---",null,null,"---",null,null,null,"---",null,null,null,"---",null,null,null,"---",null,null,null,{"$f":"IF(EB86=EC86,EB86,IF(VLOOKUP(#REF!,#REF!,11)=1,#REF!,IF(VLOOKUP(#REF!,#REF!,11)=2,#REF!,0)))","v":{"$error":"#VALUE!"}},null,null,null,null,null,null,null,null,null,null,null,null,null,null,null,null,null,null,null,null,null,"LAYER 10",null,"---",null,null,"---",null,null,"kg C2H4-eq",{"$error":"#N/A"},{"$error":"#N/A"}]
[null,null,null,null,null,null,null,null,null,null,null,null,null,null,null,null,null,null,null,null,null,null,null,null,null,null,null,null,null,null,null,null,null,null,null,null,null,null,null,null,null,null,null,null,null,null,null,null,null,null,null,null,null,null,"Chamusca",21,null,null,null,null,null,null,null,null,null,null,null,null,null,null,null,null,"ETICS EPS (70 mm) [Weber]",null,null,null,"---",null,null,null,"---",null,null,null,"---",null,null,null,"Almodôvar",null,null,null,{"$f":"IF(Loc_DB!G32=\"\",$BO$9,Loc_DB!G32)","v":"---"},null,null,null,null,null,null,null,null,null,null,null,null,null,null,null,null,null,null,null,null,null,null,null,null,null,null,null,null,null,null,null,null,null,null,null,null,null,null,null,"Rse",0.04,null,0.04,null,null,0.04,null,null,0.04,null,0.04,null,null,0.04,null,null,0.04,null,0.04,null,null,0.04,null,null,0.04,null,0.04,null,null,0.04,null,null,null,0.04,null,null,null,{"$f":"EI87","v":0.04},null,null,null,0.04,null,null,null,{"$f":"EL87","v":0.04},null,null,null,null,null,null,null,null,null,null,null,null,null,null,null,null,null,null,null,null,null,null,null,"TOTAL",null,null,{"$f":"SUM(GX66:GZ75)+SUM(GX77:GZ86)","v":1.4825234600000001E-2}]
[null,null,null,null,null,null,null,null,null,null,null,null,null,null,null,null,null,null,null,null,null,null,null,null,null,null,null,null,null,null,null,null,null,null,null,null,null,null,null,null,null,null,null,null,null,null,null,null,null,null,null,null,null,null,"Chaves",2,null,null,null,null,null,null,null,null,null,null,null,null,null,null,null,null,"ETICS EPS (100 mm) [Weber]",null,null,null,"---",null,null,null,"---",null,null,null,"---",null,null,null,"Alpiarça",null,null,null,{"$f":"IF(Loc_DB!G33=\"\",$BO$9,Loc_DB!G33)","v":"---"},null,null,null,null,null,null,null,null,null,null,null,null,null,null,null,null,null,null,null,null,null,null,null,null,null,null,null,null,null,null,null,null,null,null,null,null,null,null,null,null,{"$f":"SUM(ED76:ED87)","v":3.3030280830280829},null,{"$f":"SUM(EF76:EF87)","v":1.0048280830280831},null,null,{"$f":"SUM(EI76:EI87)","v":1.1552695177689278},null,null,{"$f":"SUM(EL76:EL87)","v":3.3030280830280829},null,{"$f":"SUM(EN76:EN87)","v":1.0048280830280831},null,null,{"$f":"SUM(EQ76:EQ87)","v":1.1552695177689278},null,null,{"$f":"SUM(ET76:ET87)","v":3.3030280830280829},null,{"$f":"SUM(EV76:EV87)","v":1.0048280830280831},null,null,{"$f":"SUM(EY76:EY87)","v":1.1552695177689278},null,null,{"$f":"SUM(FB76:FB87)","v":3.3030280830280829},null,{"$f":"SUM(FD76:FD87)","v":1.0048280830280831},null,null,{"$f":"SUM(FG76:FG87)","v":1.1552695177689278},null,null,null,{"$f":"SUM(FK76:FK87)","v":3.3030280830280829},null,null,null,{"$f":"SUM(FO76:FO87)","v":0.9435812324344226},null,null,null,{"$f":"SUM(FS76:FS87)","v":3.1730280830280826},null,null,null,{"$f":"SUM(FW76:FW87)","v":{"$error":"#REF!"}}]
[null,null,null,null,null,null,null,null,null,null,null,null,null,null,null,null,null,null,null,null,null,null,null,null,null,null,null,null,null,null,null,null,null,null,null,null,null,null,null,null,null,null,null,null,null,null,null,null,null,null,null,null,null,null,"Cinfães",6,null,null,null,null,null,null,null,null,null,null,null,null,null,null,null,null,"ETICS EPS (120 mm) [Weber]",null,null,null,"---",null,null,null,"---",null,null,null,"---",null,null,null,"Alter do Chão",null,null,null,{"$f":"IF(Loc_DB!G34=\"\",$BO$9,Loc_DB!G34)","v":"---"}]
[null,null,null,null,null,null,null,null,null,null,null,null,null,null,null,null,null,null,null,null,null,null,null,null,null,null,null,null,null,null,null,null,null,null,null,null,null,null,null,null,null,null,null,null,null,null,null,null,null,null,null,null,null,null,"Coimbra",10,null,null,null,null,null,null,null,null,null,null,null,null,null,null,null,null,"ETICS EPS (150 mm) [Weber]",null,null,null,"---",null,null,null,"---",null,null,null,"---",null,null,null,"Alvaiázere",null,null,null,{"$f":"IF(Loc_DB!G35=\"\",$BO$9,Loc_DB!G35)","v":"---"},null,null,null,null,null,null,null,null,null,null,null,null,null,null,null,null,null,null,null,null,null,null,null,null,null,null,null,null,null,null,null,null,null,null,null,null,null,null,null,null,"Rupper",null,null,null,"Rlower",null,null,null,"Rupper",null,null,null,"Rlower",null,null,null,"Rupper",null,null,null,"Rlower",null,null,null,"Rupper",null,null,null,"Rlower",null,null,null,null,null,null,null,null,null,null,null,null,null,null,null,null,null,null,null,null,null,null,null,null,null,null,null,null,null,null,null,null,null,null,null,null,null,null,"SOLUTION B"]
[null,null,null,null,null,null,null,null,null,null,null,null,null,null,null,null,null,null,null,null,null,null,null,null,null,null,null,null,null,null,null,null,null,null,null,null,null,null,null,null,null,null,null,null,null,null,null,null,null,null,null,null,null,null,"Condeixa-a-Nova",10,null,null,null,null,null,null,null,null,null,null,null,null,null,null,null,null,"---",null,null,null,"Steel C90/U93 (90 mm) [Pertecno]",null,null,null,"Steel C90/U93 (90 mm) [Pertecno]",null,null,null,"Steel C90/U93 (90 mm) [Pertecno]",null,null,null,"Alvito",null,null,null,{"$f":"IF(Loc_DB!G36=\"\",$BO$9,Loc_DB!G36)","v":"---"},null,null,null,null,null,null,null,null,null,null,null,null,null,null,null,null,null,null,null,null,null,null,null,null,null,null,null,null,null,null,null,null,null,null,null,null,null,null,null,null,{"$f":"1/($DS$66/ED88+$DS$65/EF88)","v":3.2749394503606757},"[(m2 .K)/W]",null,null,{"$f":"EI88","v":1.1552695177689278},"[(m2 .K)/W]",null,null,{"$f":"ED91","v":3.2749394503606757},"[(m2 .K)/W]",null,null,{"$f":"EH91","v":1.1552695177689278},"[(m2 .K)/W]",null,null,{"$f":"ED91","v":3.2749394503606757},"[(m2 .K)/W]",null,null,{"$f":"EH91","v":1.1552695177689278},"[(m2 .K)/W]",null,null,{"$f":"ED91","v":3.2749394503606757},"[(m2 .K)/W]",null,null,{"$f":"EH91","v":1.1552695177689278},"[(m2 .K)/W]"]
[null,null,null,null,null,null,null,null,null,null,null,null,null,null,null,null,null,null,null,null,null,null,null,null,null,null,null,null,null,null,null,null,null,null,null,null,null,null,null,null,null,null,null,null,null,null,null,null,null,null,null,null,null,null,"Constância",20,null,null,null,null,null,null,null,null,null,null,null,null,null,null,null,null,"---",null,null,null,"Steel C150/U153 (150 mm) [Pertecno]",null,null,null,"Steel C150/U153 (150 mm) [Pertecno]",null,null,null,"Steel C150/U153 (150 mm) [Pertecno]",null,null,null,"Amadora",null,null,null,{"$f":"IF(Loc_DB!G37=\"\",$BO$9,Loc_DB!G37)","v":"---"}]
[null,null,null,null,null,null,null,null,null,null,null,null,null,null,null,null,null,null,null,null,null,null,null,null,null,null,null,null,null,null,null,null,null,null,null,null,null,null,null,null,null,null,null,null,null,null,null,null,null,null,null,null,null,null,"Coruche",21,null,null,null,null,null,null,null,null,null,null,null,null,null,null,null,null,"---",null,null,null,"Steel C200/U204 (200 mm) [Pertecno]",null,null,null,"Steel C200/U204 (200 mm) [Pertecno]",null,null,null,"Steel C200/U204 (200 mm) [Pertecno]",null,null,null,"Amarante",null,null,null,{"$f":"IF(Loc_DB!G38=\"\",$BO$9,Loc_DB!G38)","v":"---"},null,null,null,null,null,null,null,null,null,null,null,null,null,null,null,null,null,null,null,null,null,null,null,null,null,null,null,null,null,null,null,null,null,null,null,null,null,null,null,null,null,null,null,null,"Rtotal",null,null,null,"p",null,null,null,"Rtotal",null,null,null,"p",null,null,null,"Rtotal",null,null,null,"p",null,null,null,"Rtotal",null,null,null,null,null,null,null,"Rtotal",null,null,null,null,null,null,null,"Rtotal",null,null,null,null,null,null,null,null,null,null,null,null,null,null,null,null,null,null,null,null,null,null,"Layers",null,"Material 1",null,null,"Indicator",null,null,null,null,null,null,"Chosen Indicator"]
[null,null,null,null,null,null,null,null,null,null,null,null,null,null,null,null,null,null,null,null,null,null,null,null,null,null,null,null,null,null,null,null,null,null,null,null,null,null,null,null,null,null,null,null,null,null,null,null,null,null,null,null,null,null,"Covilhã",13,null,null,null,null,null,null,null,null,null,null,null,null,null,null,null,null,"---",null,null,null,"Steel C250/U255 (250 mm) [Pertecno]",null,null,null,"Steel C250/U255 (250 mm) [Pertecno]",null,null,null,"Steel C250/U255 (250 mm) [Pertecno]",null,null,null,"Amares",null,null,null,{"$f":"IF(Loc_DB!G39=\"\",$BO$9,Loc_DB!G39)","v":"---"},null,null,null,null,null,null,null,null,null,null,null,null,null,null,null,null,null,null,null,null,null,null,null,null,null,null,null,null,null,null,null,null,null,null,null,null,null,null,null,null,null,null,null,null,{"$f":"(ED91+EH91)/2","v":2.2151044840648018},"[(m2 .K)/W]",null,null,{"$f":"0.8*(EP91/EL91)+0.1","v":0.38220845857573227},null,null,null,{"$f":"EL91*EL94+EP91*(1-EL94)","v":1.9654252953941462},"[(m2 .K)/W]",null,null,{"$f":"EV98","v":0.25},null,null,null,{"$f":"ET91*ET94+EX91*(1-ET94)","v":1.6851870009168648},"[(m2 .K)/W]",null,null,{"$f":"0.8*(FF91/FB91)+0.44-0.1*(DM60/0.04)-0.2*(0.6/DM59)-0.04*(DM57/0.1)","v":0.27870845857573223},null,null,null,{"$f":"FB91*FB94+FF91*(1-FB94)","v":1.7460394573709002},"[(m2 .K)/W]",null,null,null,null,null,null,{"$f":"1/(DS61/FO88+DS62/FK88)","v":1.9427902478862875},"[(m2 .K)/W]",null,null,null,null,null,null,{"$f":"1/(#REF!/FS88+#REF!/FW88)","v":{"$error":"#REF!"}},"[(m2 .K)/W]",null,null,null,null,null,null,null,null,null,null,null,null,null,null,null,null,null,null,null,null,null,"LAYER 1",null,{"$f":"GU39","v":"Gypsum Board (12,5 mm) [Gyptec]"},null,null,{"$f":"IF($HE$95=1,HD39,IF($HE$95=2,HJ39,IF($HE$95=3,HP39,IF($HE$95=4,HV39,IF($HE$95=5,IB39,IF($HE$95=6,IH39,IF($HE$95=7,IN39,0)))))))","v":2.5},null,null,{"$f":"IF($HE$95=1,$SV$316,IF($HE$95=2,$SV$317,IF($HE$95=3,$SV$318,IF($HE$95=4,$SV$319,IF($HE$95=5,$SV$320,IF($HE$95=6,$SV$321,IF($HE$95=7,$SV$322,0)))))))","v":"kg CO2-eq"},{"$f":"VLOOKUP(HB93,$ST$316:$SV$322,2)","v":{"$error":"#N/A"}},{"$f":"VLOOKUP(HC93,$ST$316:$SV$322,2)","v":{"$error":"#N/A"}},null,{"$f":"SB_LCA!H10","v":"Global Warming Potential (GWP)"}]
[null,null,null,null,null,null,null,null,null,null,null,null,null,null,null,null,null,null,null,null,null,null,null,null,null,null,null,null,null,null,null,null,null,null,null,null,null,null,null,null,null,null,null,null,null,null,null,null,null,null,null,null,null,null,"Crato",24,null,null,null,null,null,null,null,null,null,null,null,null,null,null,null,null,"---",null,null,null,"TB Strip Aerogel (10 mm) [Spacetherm]",null,null,null,{"$f":"IF(VLOOKUP(C37,$C$9:$AV$61,36)=1,D37,$D$9)","v":"---"},null,null,null,"---",null,null,null,"Anadia",null,null,null,{"$f":"IF(Loc_DB!G40=\"\",$BO$9,Loc_DB!G40)","v":"---"},null,null,null,null,null,null,null,null,null,null,null,null,null,null,null,null,null,null,null,null,null,null,null,null,null,null,null,null,null,null,null,null,null,null,null,null,null,null,null,null,null,null,null,null,null,null,null,null,null,null,null,null,null,null,null,null,null,null,null,null,null,null,null,null,null,null,null,null,null,null,null,null,null,null,null,null,null,null,null,null,null,null,null,null,null,null,null,null,null,null,null,null,null,null,null,null,null,null,null,null,null,null,null,null,null,null,null,"LAYER 2",null,"OSB (12 mm) [Kronospan]",null,null,-9.0359999999999996,null,null,"kg CO2-eq",{"$error":"#N/A"},{"$error":"#N/A"},null,{"$f":"VLOOKUP(HE94,$IM$166:$IN$172,2)","v":6}]
[null,null,null,null,null,null,null,null,null,null,null,null,null,null,null,null,null,null,null,null,null,null,null,null,null,null,null,null,null,null,null,null,null,null,null,null,null,null,null,null,null,null,null,null,null,null,null,null,null,null,null,null,null,null,"Cuba",27,null,null,null,null,null,null,null,null,null,null,null,null,null,null,null,null,"---",null,null,null,"TB Strip Rubber (10 mm) [Acousticork]",null,null,null,"---",null,null,null,"---",null,null,null,"Angra do Heroísmo",null,null,null,null,null,null,null,null,null,null,null,null,null,null,null,null,null,null,null,null,null,null,null,null,null,null,null,null,null,null,null,null,null,null,null,null,null,null,null,null,null,null,null,null,null,null,null,null,null,null,null,null,null,null,null,null,null,null,null,null,{"$f":"VLOOKUP(CO34,$C$9:$AV$61,36)","v":5},{"$f":"IF(ET96=3,2,1)","v":1},{"$f":"IF($DM$14<0.5,1,2)","v":1},null,null,null,null,null,null,null,null,null,null,null,null,null,null,null,null,null,null,null,null,null,null,null,null,null,null,null,null,null,null,null,null,null,null,null,null,null,null,null,null,null,null,null,null,null,null,null,null,"LAYER 3",null,"Air Cavity (10 mm) [ISO 6946]",null,null,0,null,null,"kg CO2-eq",{"$error":"#N/A"},{"$error":"#N/A"}]
[null,null,null,null,null,null,null,null,null,null,null,null,null,null,null,null,null,null,null,null,null,null,null,null,null,null,null,null,null,null,null,null,null,null,null,null,null,null,null,null,null,null,null,null,null,null,null,null,null,null,null,null,null,null,"Elvas",24,null,null,null,null,null,null,null,null,null,null,null,null,null,null,null,null,"---",null,null,null,"TB Strip Aerogel/Rubber (10 mm) [T4BI]",null,null,null,"---",null,null,null,"---",null,null,null,"Ansião",null,null,null,null,null,null,null,null,null,null,null,null,null,null,null,null,null,null,null,null,null,null,null,null,null,null,null,null,null,null,null,null,null,null,null,null,null,null,null,null,null,null,null,null,null,null,null,null,null,null,null,null,null,null,null,null,null,null,null,null,{"$f":"VLOOKUP(CO35,$C$9:$AV$61,36)","v":5},{"$f":"IF(ET97=3,2,1)","v":1},{"$f":"EU106*EV96","v":10},null,null,null,null,null,null,null,null,null,null,null,null,null,null,null,null,null,null,null,null,null,null,null,null,null,null,null,null,null,null,null,null,null,null,null,null,null,null,null,null,null,null,null,null,null,null,null,null,"LAYER 4",null,"Mineral wool (90 mm) [Volcalis]",null,null,1.5209999999999999,null,null,"kg CO2-eq",{"$error":"#N/A"},{"$error":"#N/A"}]
[null,null,null,null,null,null,null,null,null,null,null,null,null,null,null,null,null,null,null,null,null,null,null,null,null,null,null,null,null,null,null,null,null,null,null,null,null,null,null,null,null,null,null,null,null,null,null,null,null,null,null,null,null,null,"Entroncamento",20,null,null,null,null,null,null,null,null,null,null,null,null,null,null,null,null,"---",null,null,null,"TB Strip Rubber and Cork (10 mm) [Acousticork]",null,null,null,"---",null,null,null,"---",null,null,null,"Arcos de Valdevez",null,null,null,null,null,null,null,null,null,null,null,null,null,null,null,null,null,null,null,null,null,null,null,null,null,null,null,null,null,null,null,null,null,null,null,null,null,null,null,null,null,null,null,null,null,null,null,null,null,null,null,null,null,null,null,null,null,null,null,null,7,1,{"$f":"IF(EV97=20,0.3,IF(EV97=22,0.5,IF(EV97=10,0.25,IF(EV97=11,0.4,0.4))))","v":0.25},null,null,null,null,null,null,null,null,null,null,null,null,null,null,null,null,null,null,null,null,null,null,null,null,null,null,null,null,null,null,null,null,null,null,null,null,null,null,null,null,null,null,null,null,null,null,null,null,"LAYER 5",null,"Air Cavity (10 mm) [ISO 6946]",null,null,0,null,null,"kg CO2-eq",{"$error":"#N/A"},{"$error":"#N/A"}]
[null,null,null,null,null,null,null,null,null,null,null,null,null,null,null,null,null,null,null,null,null,null,null,null,null,null,null,null,null,null,null,null,null,null,null,null,null,null,null,null,null,null,null,null,null,null,null,null,null,null,null,null,null,null,"Espinho",5,null,null,null,null,null,null,null,null,null,null,null,null,null,null,null,null,"---",null,null,null,"TB Strip XPS (10 mm) [IFoam]",null,null,null,"---",null,null,null,"---",null,null,null,"Arganil",null,null,null,null,null,null,null,null,null,null,null,null,null,null,null,null,null,null,null,null,null,null,null,null,null,null,null,null,null,null,null,null,null,null,null,null,null,null,null,null,null,null,null,null,null,null,null,null,null,null,null,null,null,null,null,null,null,null,null,null,2,1,null,null,null,null,null,null,null,null,null,null,null,null,null,null,null,null,null,null,null,null,null,null,null,null,null,null,null,null,null,null,null,null,null,null,null,null,null,null,null,null,null,null,null,null,null,null,null,null,null,"LAYER 6",null,"OSB (12 mm) [Kronospan]",null,null,-9.0359999999999996,null,null,"kg CO2-eq",{"$error":"#N/A"},{"$error":"#N/A"}]
[null,null,null,null,null,null,null,null,null,null,null,null,null,null,null,null,null,null,null,null,null,null,null,null,null,null,null,null,null,null,null,null,null,null,null,null,null,null,null,null,null,null,null,null,null,null,null,null,null,null,null,null,null,null,"Esposende",3,null,null,null,null,null,null,null,null,null,null,null,null,null,null,null,null,"Air Cavity (10 mm) [ISO 6946]",null,null,null,"---",null,null,null,"---",null,null,null,"---",null,null,null,"Armamar",null,null,null,null,null,null,null,null,null,null,null,null,null,null,null,null,null,null,null,null,null,null,null,null,null,null,null,null,null,null,null,null,null,null,null,null,null,null,null,null,null,null,null,null,null,null,null,null,null,null,null,null,null,null,null,null,null,null,null,null,7,1,null,null,null,null,null,null,null,null,null,null,null,null,null,null,null,null,null,null,null,null,null,null,null,null,null,null,null,null,null,null,null,null,null,null,null,null,null,null,null,null,null,null,null,null,null,null,null,null,null,"LAYER 7",null,"Mortar (10 mm)",null,null,1.42,null,null,"kg CO2-eq",{"$error":"#N/A"},{"$error":"#N/A"}]
[null,null,null,null,null,null,null,null,null,null,null,null,null,null,null,null,null,null,null,null,null,null,null,null,null,null,null,null,null,null,null,null,null,null,null,null,null,null,null,null,null,null,null,null,null,null,null,null,null,null,null,null,null,null,"Estarreja",9,null,null,null,null,null,null,null,null,null,null,null,null,null,null,null,null,"Air Cavity (15 mm) [ISO 6946]",null,null,null,"---",null,null,null,"---",null,null,null,"---",null,null,null,"Arouca",null,null,null,null,null,null,null,null,null,null,null,null,null,null,null,null,null,null,null,null,null,null,null,null,null,null,null,null,null,null,null,null,null,null,null,null,null,null,null,null,null,null,null,null,null,null,null,null,null,null,null,null,null,null,null,null,null,null,null,null,5,1,null,null,null,null,null,null,null,null,null,null,null,null,null,null,null,null,null,null,null,null,null,null,null,null,null,null,null,null,1,null,null,null,null,null,null,null,null,null,null,null,null,null,null,null,null,null,null,null,null,"LAYER 8",null,"---",null,null,"---",null,null,"kg CO2-eq",{"$error":"#N/A"},{"$error":"#N/A"}]
[null,null,null,null,null,null,null,null,null,null,null,null,null,null,null,null,null,null,null,null,null,null,null,null,null,null,null,null,null,null,null,null,null,null,null,null,null,null,null,null,null,null,null,null,null,null,null,null,null,null,null,null,null,null,"Estremoz",25,null,null,null,null,null,null,null,null,null,null,null,null,null,null,null,null,"Air Cavity (20 mm) [ISO 6946]",null,null,null,"---",null,null,null,"---",null,null,null,"---",null,null,null,"Arraiolos",null,null,null,null,null,null,null,null,null,null,null,null,null,null,null,null,null,null,null,null,null,null,null,null,null,null,null,null,null,null,null,null,null,null,null,null,null,null,null,null,null,null,null,null,null,null,null,null,null,null,null,null,null,null,null,null,null,null,null,null,4,1,null,null,null,null,null,null,null,null,null,null,null,null,null,null,null,null,null,null,null,null,null,null,null,null,null,null,null,null,2,null,null,null,null,null,null,null,null,null,null,null,null,null,null,null,null,null,null,null,null,"LAYER 9",null,"---",null,null,"---",null,null,"kg CO2-eq",{"$error":"#N/A"},{"$error":"#N/A"}]
[null,null,null,null,null,null,null,null,null,null,null,null,null,null,null,null,null,null,null,null,null,null,null,null,null,null,null,null,null,null,null,null,null,null,null,null,null,null,null,null,null,null,null,null,null,null,null,null,null,null,null,null,null,null,"Évora",25,null,null,null,null,null,null,null,null,null,null,null,null,null,null,null,null,"Air Cavity (25 mm) [ISO 6946]",null,null,null,"---",null,null,null,"---",null,null,null,"---",null,null,null,"Arronches",null,null,null,null,null,null,null,null,null,null,null,null,null,null,null,null,null,null,null,null,null,null,null,null,null,null,null,null,null,null,null,null,null,null,null,null,null,null,null,null,null,null,null,null,null,null,null,null,null,null,null,null,null,null,null,null,null,null,null,null,0,1,null,null,null,null,null,null,null,null,null,null,null,null,null,null,null,null,null,null,null,null,null,null,null,null,null,null,null,null,3,null,null,null,null,null,null,null,null,null,null,null,null,null,null,null,null,null,null,null,null,"LAYER 10",null,"---",null,null,"---",null,null,"kg CO2-eq",{"$error":"#N/A"},{"$error":"#N/A"}]
[null,null,null,null,null,null,null,null,null,null,null,null,null,null,null,null,null,null,null,null,null,null,null,null,null,null,null,null,null,null,null,null,null,null,null,null,null,null,null,null,null,null,null,null,null,null,null,null,null,null,null,null,null,null,"Fafe",4,null,null,null,null,null,null,null,null,null,null,null,null,null,null,null,null,"Air Cavity (90 mm) [ISO 6946]",null,null,null,"---",null,null,null,"---",null,null,null,"---",null,null,null,"Arruda dos Vinhos",null,null,null,null,null,null,null,null,null,null,null,null,null,null,null,null,null,null,null,null,null,null,null,null,null,null,null,null,null,null,null,null,null,null,null,null,null,null,null,null,null,null,null,null,null,null,null,null,null,null,null,null,null,null,null,null,null,null,null,null,0,1,null,null,null,null,null,null,null,null,null,null,null,null,null,null,null,null,null,null,null,null,null,null,null,null,null,null,null,null,4,null,null,null,null,null,null,null,null,null,null,null,null,null,null,null,null,null,null,null,null,null,null,"Material 2",null,null,"Indicator"]
[null,null,null,null,null,null,null,null,null,null,null,null,null,null,null,null,null,null,null,null,null,null,null,null,null,null,null,null,null,null,null,null,null,null,null,null,null,null,null,null,null,null,null,null,null,null,null,null,null,null,null,null,null,null,"Faro",28,null,null,null,null,null,null,null,null,null,null,null,null,null,null,null,null,"Air Cavity (150 mm) [ISO 6946]",null,null,null,"---",null,null,null,"---",null,null,null,"---",null,null,null,"Aveiro",null,null,null,null,null,null,null,null,null,null,null,null,null,null,null,null,null,null,null,null,null,null,null,null,null,null,null,null,null,null,null,null,null,null,null,null,null,null,null,null,null,null,null,null,null,null,null,null,null,null,null,null,null,null,null,null,null,null,null,null,0,1,null,null,null,null,null,null,null,null,null,null,null,null,null,null,null,null,null,null,null,null,null,null,null,null,null,null,null,null,5,null,null,null,null,null,null,null,null,null,null,null,null,null,null,null,null,null,null,null,null,"LAYER 1",null,{"$f":"GU50","v":"---"},null,null,{"$f":"IF($HE$95=1,HD50,IF($HE$95=2,HJ50,IF($HE$95=3,HP50,IF($HE$95=4,HV50,IF($HE$95=5,IB50,IF($HE$95=6,IH50,IF($HE$95=7,IN50,0)))))))","v":"---"},null,null,{"$f":"IF($HE$95=1,$SV$316,IF($HE$95=2,$SV$317,IF($HE$95=3,$SV$318,IF($HE$95=4,$SV$319,IF($HE$95=5,$SV$320,IF($HE$95=6,$SV$321,IF($HE$95=7,$SV$322,0)))))))","v":"kg CO2-eq"},{"$f":"VLOOKUP(HB104,$ST$316:$SV$322,2)","v":{"$error":"#N/A"}},{"$f":"VLOOKUP(HC104,$ST$316:$SV$322,2)","v":{"$error":"#N/A"}}]
[null,null,null,null,null,null,null,null,null,null,null,null,null,null,null,null,null,null,null,null,null,null,null,null,null,null,null,null,null,null,null,null,null,null,null,null,null,null,null,null,null,null,null,null,null,null,null,null,null,null,null,null,null,null,"Felgueiras",6,null,null,null,null,null,null,null,null,null,null,null,null,null,null,null,null,"Air Cavity (200 mm) [ISO 6946]",null,null,null,"---",null,null,null,{"$f":"IF(VLOOKUP(C48,$C$9:$AV$61,36)=1,D48,$D$9)","v":"---"},null,null,null,"---",null,null,null,"Avis",null,null,null,null,null,null,null,null,null,null,null,null,null,null,null,null,null,null,null,null,null,null,null,null,null,null,null,null,null,null,null,null,null,null,null,null,null,null,null,null,null,null,null,null,null,null,null,null,null,null,null,null,null,null,null,null,null,null,null,null,null,{"$f":"SUM(EU96:EU105)","v":10},null,null,null,null,null,null,null,null,null,null,null,null,null,null,null,null,null,null,null,null,null,null,null,null,null,null,null,null,null,null,null,null,null,null,null,null,null,null,null,null,null,null,null,null,null,null,null,null,null,"LAYER 2",null,"---",null,null,"---",null,null,"kg CO2-eq",{"$error":"#N/A"},{"$error":"#N/A"}]
[null,null,null,null,null,null,null,null,null,null,null,null,null,null,null,null,null,null,null,null,null,null,null,null,null,null,null,null,null,null,null,null,null,null,null,null,null,null,null,null,null,null,null,null,null,null,null,null,null,null,null,null,null,null,"Ferreira do Alentejo",27,null,null,null,null,null,null,null,null,null,null,null,null,null,null,null,null,"Mortar (10 mm)",null,null,null,"---",null,null,null,"---",null,null,null,"---",null,null,null,"Azambuja",null,null,null,null,null,null,null,null,null,null,null,null,null,null,null,null,null,null,null,null,null,null,null,null,null,null,null,null,null,null,null,null,null,null,null,null,null,null,null,null,null,null,null,null,null,null,null,null,null,null,null,null,null,null,null,null,null,null,null,null,null,null,null,null,null,null,null,null,null,null,null,null,null,null,null,null,null,null,null,null,null,null,null,null,null,null,null,null,null,null,null,null,null,null,null,null,null,null,null,null,null,null,null,null,null,null,null,null,null,null,null,"LAYER 3",null,"TB Strip XPS (10 mm) [IFoam]",null,null,0.75588235294117645,null,null,"kg CO2-eq",{"$error":"#N/A"},{"$error":"#N/A"}]
[null,null,null,null,null,null,null,null,null,null,null,null,null,null,null,null,null,null,null,null,null,null,null,null,null,null,null,null,null,null,null,null,null,null,null,null,null,null,null,null,null,null,null,null,null,null,null,null,null,null,null,null,null,null,"Ferreira do Zêzere",20,null,null,null,null,null,null,null,null,null,null,null,null,null,null,null,null,"---",null,null,null,"---",null,null,null,"---",null,null,null,"---",null,null,null,"Baião",null,null,null,null,null,null,null,null,null,null,null,null,null,null,null,null,null,null,null,null,null,null,null,null,null,null,null,null,null,null,null,null,null,null,null,null,null,null,null,null,null,null,null,null,null,null,null,null,null,null,null,null,null,null,null,null,null,null,null,null,null,null,null,null,null,null,null,null,null,null,null,null,null,null,null,null,null,null,null,null,null,null,null,null,null,null,null,null,null,null,null,null,null,null,null,null,null,null,null,null,null,null,null,null,null,null,null,null,null,null,null,"LAYER 4",null,"Steel C90/U93 (90 mm) [Pertecno]",null,null,5.5312800000000013E-3,null,null,"kg CO2-eq",{"$error":"#N/A"},{"$error":"#N/A"}]
[null,null,null,null,null,null,null,null,null,null,null,null,null,null,null,null,null,null,null,null,null,null,null,null,null,null,null,null,null,null,null,null,null,null,null,null,null,null,null,null,null,null,null,null,null,null,null,null,null,null,null,null,null,null,"Figueira da Foz",10,null,null,null,null,null,null,null,null,null,null,null,null,null,null,null,null,"---",null,null,null,"---",null,null,null,"---",null,null,null,"---",null,null,null,"Barcelos",null,null,null,null,null,null,null,null,null,null,null,null,null,null,null,null,null,null,null,null,null,null,null,null,null,null,null,null,null,null,null,null,null,null,null,null,null,null,null,null,null,null,null,null,null,null,null,null,null,null,null,null,null,null,null,null,null,null,null,null,null,null,null,null,null,null,null,null,null,null,null,null,null,null,null,null,null,null,null,null,null,null,null,null,null,null,null,null,null,null,null,null,null,null,null,null,null,null,null,null,null,null,null,null,null,null,null,null,null,null,null,"LAYER 5",null,"TB Strip XPS (10 mm) [IFoam]",null,null,0.75588235294117645,null,null,"kg CO2-eq",{"$error":"#N/A"},{"$error":"#N/A"}]
[null,null,null,null,null,null,null,null,null,null,null,null,null,null,null,null,null,null,null,null,null,null,null,null,null,null,null,null,null,null,null,null,null,null,null,null,null,null,null,null,null,null,null,null,null,null,null,null,null,null,null,null,null,null,"Figueira de Castelo Rodrigo",11,null,null,null,null,null,null,null,null,null,null,null,null,null,null,null,null,"---",null,null,null,"---",null,null,null,"---",null,null,null,"---",null,null,null,"Barrancos",null,null,null,null,null,null,null,null,null,null,null,null,null,null,null,null,null,null,null,null,null,null,null,null,null,null,null,null,null,null,null,null,null,null,null,null,null,null,null,null,null,null,null,null,null,null,null,null,null,null,null,null,null,null,null,null,null,null,null,null,null,null,null,null,null,null,null,null,null,null,null,null,null,null,null,null,null,null,null,null,null,null,null,null,null,null,null,null,null,null,null,null,null,null,null,null,null,null,null,null,null,null,null,null,null,null,null,null,null,null,null,"LAYER 6",null,"---",null,null,"---",null,null,"kg CO2-eq",{"$error":"#N/A"},{"$error":"#N/A"}]
[null,null,null,null,null,null,null,null,null,null,null,null,null,null,null,null,null,null,null,null,null,null,null,null,null,null,null,null,null,null,null,null,null,null,null,null,null,null,null,null,null,null,null,null,null,null,null,null,null,null,null,null,null,null,"Figueiró dos Vinhos",16,null,null,null,null,null,null,null,null,null,null,null,null,null,null,null,null,"---",null,null,null,"---",null,null,null,"---",null,null,null,"---",null,null,null,"Barreiro",null,null,null,null,null,null,null,null,null,null,null,null,null,null,null,null,null,null,null,null,null,null,null,null,null,null,null,null,null,null,null,null,null,null,null,null,null,null,null,null,null,null,null,null,null,null,null,null,null,null,null,null,null,null,null,null,null,null,null,null,null,null,null,null,null,null,null,null,null,null,null,null,null,null,null,null,null,null,null,null,null,null,null,null,null,null,null,null,null,null,null,null,null,null,null,null,null,null,null,null,null,null,null,null,null,null,null,null,null,null,null,"LAYER 7",null,"---",null,null,"---",null,null,"kg CO2-eq",{"$error":"#N/A"},{"$error":"#N/A"}]
[null,null,null,null,null,null,null,null,null,null,null,null,null,null,null,null,null,null,null,null,null,null,null,null,null,null,null,null,null,null,null,null,null,null,null,null,null,null,null,null,null,null,null,null,null,null,null,null,null,null,null,null,null,null,"Fornos de Algodres",14,null,null,null,null,null,null,null,null,null,null,null,null,null,null,null,null,"---",null,null,null,"---",null,null,null,"---",null,null,null,"---",null,null,null,"Batalha",null,null,null,null,null,null,null,null,null,null,null,null,null,null,null,null,null,null,null,null,null,null,null,null,null,null,null,null,null,null,null,null,null,null,null,null,null,null,null,null,null,null,null,null,null,null,null,null,null,null,null,null,null,null,null,null,null,null,null,null,null,null,null,null,null,null,null,null,null,null,null,null,null,null,null,null,null,null,null,null,null,null,null,null,null,null,null,null,null,null,null,null,null,null,null,null,null,null,null,null,null,null,null,null,null,null,null,null,null,null,null,"LAYER 8",null,"---",null,null,"---",null,null,"kg CO2-eq",{"$error":"#N/A"},{"$error":"#N/A"}]
[null,null,null,null,null,null,null,null,null,null,null,null,null,null,null,null,null,null,null,null,null,null,null,null,null,null,null,null,null,null,null,null,null,null,null,null,null,null,null,null,null,null,null,null,null,null,null,null,null,null,null,null,null,null,"Freixo de Espada à Cinta",7,null,null,null,null,null,null,null,null,null,null,null,null,null,null,null,null,"---",null,null,null,"---",null,null,null,"---",null,null,null,"---",null,null,null,"Beja",null,null,null,null,null,null,null,null,null,null,null,null,null,null,null,null,null,null,null,null,null,null,null,null,null,null,null,null,null,null,null,null,null,null,null,null,null,null,null,null,null,null,null,null,null,null,null,null,null,null,null,null,null,null,null,null,null,null,null,null,null,null,null,null,null,null,null,null,null,null,null,null,null,null,null,null,null,null,null,null,null,null,null,null,null,null,null,null,null,null,null,null,null,null,null,null,null,null,null,null,null,null,null,null,null,null,null,null,null,null,null,"LAYER 9",null,"---",null,null,"---",null,null,"kg CO2-eq",{"$error":"#N/A"},{"$error":"#N/A"}]
[null,null,null,null,null,null,null,null,null,null,null,null,null,null,null,null,null,null,null,null,null,null,null,null,null,null,null,null,null,null,null,null,null,null,null,null,null,null,null,null,null,null,null,null,null,null,null,null,null,null,null,null,null,null,"Fronteira",24,null,null,null,null,null,null,null,null,null,null,null,null,null,null,null,null,"---",null,null,null,"---",null,null,null,{"$f":"IF(VLOOKUP(C56,$C$9:$AV$61,36)=1,D56,$D$9)","v":"---"},null,null,null,"---",null,null,null,"Belmonte",null,null,null,null,null,null,null,null,null,null,null,null,null,null,null,null,null,null,null,null,null,null,null,null,null,null,null,null,null,null,null,null,null,null,null,null,null,null,null,null,null,null,null,null,null,null,null,null,null,null,null,null,null,null,null,null,null,null,null,null,null,null,null,null,null,null,null,null,null,null,null,null,null,null,null,null,null,null,null,null,null,null,null,null,null,null,null,null,null,null,null,null,null,null,null,null,null,null,null,null,null,null,null,null,null,null,null,null,null,null,null,"LAYER 10",null,"---",null,null,"---",null,null,"kg CO2-eq",{"$error":"#N/A"},{"$error":"#N/A"}]
[null,null,null,null,null,null,null,null,null,null,null,null,null,null,null,null,null,null,null,null,null,null,null,null,null,null,null,null,null,null,null,null,null,null,null,null,null,null,null,null,null,null,null,null,null,null,null,null,null,null,null,null,null,null,"Funchal",30,null,null,null,null,null,null,null,null,null,null,null,null,null,null,null,null,"---",null,null,null,"---",null,null,null,"---",null,null,null,"---",null,null,null,"Benavente",null,null,null,null,null,null,null,null,null,null,null,null,null,null,null,null,null,null,null,null,null,null,null,null,null,null,null,null,null,null,null,null,null,null,null,null,null,null,null,null,null,null,null,null,null,null,null,null,null,null,null,null,null,null,null,null,null,null,null,null,null,null,null,null,null,null,null,null,null,null,null,null,null,null,null,null,null,null,null,null,null,null,null,null,null,null,null,null,null,null,null,null,null,null,null,null,null,null,null,null,null,null,null,null,null,null,null,null,null,null,null,null,null,"TOTAL",null,null,{"$f":"SUM(GX94:GZ103)+SUM(GX105:GZ114)","v":-11.113704014117646}]
[null,null,null,null,null,null,null,null,null,null,null,null,null,null,null,null,null,null,null,null,null,null,null,null,null,null,null,null,null,null,null,null,null,null,null,null,null,null,null,null,null,null,null,null,null,null,null,null,null,null,null,null,null,null,"Fundão",13,null,null,null,null,null,null,null,null,null,null,null,null,null,null,null,null,"---",null,null,null,"---",null,null,null,"---",null,null,null,"---",null,null,null,"Bombarral"]
[null,null,null,null,null,null,null,null,null,null,null,null,null,null,null,null,null,null,null,null,null,null,null,null,null,null,null,null,null,null,null,null,null,null,null,null,null,null,null,null,null,null,null,null,null,null,null,null,null,null,null,null,null,null,"Gavião",24,null,null,null,null,null,null,null,null,null,null,null,null,null,null,null,null,null,null,null,null,null,null,null,null,null,null,null,null,null,null,null,null,"Borba"]
[null,null,null,null,null,null,null,null,null,null,null,null,null,null,null,null,null,null,null,null,null,null,null,null,null,null,null,null,null,null,null,null,null,null,null,null,null,null,null,null,null,null,null,null,null,null,null,null,null,null,null,null,null,null,"Góis",16,null,null,null,null,null,null,null,null,null,null,null,null,null,null,null,null,null,null,null,null,null,null,null,null,null,null,null,null,null,null,null,null,"Boticas"]
[null,null,null,null,null,null,null,null,null,null,null,null,null,null,null,null,null,null,null,null,null,null,null,null,null,null,null,null,null,null,null,null,null,null,null,null,null,null,null,null,null,null,null,null,null,null,null,null,null,null,null,null,null,null,"Golegã",21,null,null,null,null,null,null,null,null,null,null,null,null,null,null,null,null,null,null,null,null,null,null,null,null,null,null,null,null,null,null,null,null,"Braga",null,null,null,null,null,null,null,null,null,null,null,null,null,null,null,null,null,null,null,null,null,null,null,null,null,null,null,null,null,null,null,null,null,null,null,null,null,null,null,null,null,null,null,null,null,null,null,null,null,null,null,null,null,null,null,null,null,null,null,null,null,null,null,null,null,null,null,null,null,null,null,null,null,null,null,null,null,null,null,null,null,null,null,null,null,null,null,null,null,null,null,null,null,null,null,null,null,null,null,null,null,null,null,null,null,null,null,null,null,null,null,"GLOBAL A"]
[null,null,null,null,null,null,null,null,null,null,null,null,null,null,null,null,null,null,null,null,null,null,null,null,null,null,null,null,null,null,null,null,null,null,null,null,null,null,null,null,null,null,null,null,null,null,null,null,null,null,null,null,null,null,"Gondomar",5,null,null,null,null,null,null,null,null,null,null,null,null,null,null,null,null,null,null,null,null,null,null,null,null,null,null,null,null,null,null,null,null,"Bragança"]
[null,null,null,null,null,null,null,null,null,null,null,null,null,null,null,null,null,null,null,null,null,null,null,null,null,null,null,null,null,null,null,null,null,null,null,null,null,null,null,null,null,null,null,null,null,null,null,null,null,null,null,null,null,null,"Gouveia",14,null,null,null,null,null,null,null,null,null,null,null,null,null,null,null,null,null,null,null,null,null,null,null,null,null,null,null,null,null,null,null,null,"Cabeceiras de Basto",null,null,null,null,null,null,null,null,null,null,null,null,null,null,null,null,null,null,null,null,null,null,null,null,null,null,null,null,null,null,null,null,null,null,null,null,null,null,null,null,null,null,null,null,null,null,null,null,null,null,null,null,null,null,null,null,null,null,null,null,null,null,null,null,null,null,null,null,null,null,null,null,null,null,null,null,null,null,null,null,null,null,null,null,null,null,null,null,null,null,null,null,null,null,null,null,null,null,null,null,null,null,null,null,null,null,null,null,null,null,null,null,null,null,null,null,null,null,null,null,null,null,null,null,null,null,null,null,null,"SOLUTION A (COMPONENTS)",null,null,null,null,null,null,"SOLUTION B (CHOSEN COMPONENT)"]
[null,null,null,null,null,null,null,null,null,null,null,null,null,null,null,null,null,null,null,null,null,null,null,null,null,null,null,null,null,null,null,null,null,null,null,null,null,null,null,null,null,null,null,null,null,null,null,null,null,null,null,null,null,null,"Grândola",26,null,null,null,null,null,null,null,null,null,null,null,null,null,null,null,null,null,null,null,null,null,null,null,null,null,null,null,null,null,null,null,null,"Cadaval",null,null,null,null,null,null,null,null,null,null,null,null,null,null,null,null,null,null,null,null,null,null,null,null,null,null,null,null,null,null,null,null,null,null,null,null,null,null,null,null,null,null,null,null,null,null,null,null,null,null,null,null,null,null,null,null,null,null,null,null,null,null,null,null,null,null,null,null,null,null,null,null,null,null,null,null,null,null,null,null,null,null,null,null,null,null,null,null,null,null,null,null,null,null,null,null,null,null,null,null,null,null,null,null,null,null,null,null,null,null,null,"Layers",null,"Material 1",null,null,"Indicator",null,null,null,null,null,null,"Chosen Indicator"]
[null,null,null,null,null,null,null,null,null,null,null,null,null,null,null,null,null,null,null,null,null,null,null,null,null,null,null,null,null,null,null,null,null,null,null,null,null,null,null,null,null,null,null,null,null,null,null,null,null,null,null,null,null,null,"Guarda",11,null,null,null,null,null,null,null,null,null,null,null,null,null,null,null,null,null,null,null,null,null,null,null,null,null,null,null,null,null,null,null,null,"Caldas da Rainha",null,null,null,null,null,null,null,null,null,null,null,null,null,null,null,null,null,null,null,null,null,null,null,null,null,null,null,null,null,null,null,null,null,null,null,null,null,null,null,null,null,null,null,null,null,null,null,null,null,null,null,null,null,null,null,null,null,null,null,null,null,null,null,null,null,null,null,null,null,null,null,null,null,null,null,null,null,null,null,null,null,null,null,null,null,null,null,null,null,null,null,null,null,null,null,null,null,null,null,null,null,null,null,null,null,null,null,null,null,null,null,"LAYER 1",null,{"$f":"GU66","v":"Gypsum Board (12,5 mm) [Gyptec]"},null,null,{"$f":"IF($HE$124=1,HD12,IF($HE$124=2,HJ12,IF($HE$124=3,HP12,IF($HE$124=4,HV12,IF($HE$124=5,IB12,IF($HE$124=6,IH12,IF($HE$124=7,IN12,0)))))))","v":9.3999999999999997E-4},null,null,{"$f":"IF($HE$124=1,$SV$316,IF($HE$124=2,$SV$317,IF($HE$124=3,$SV$318,IF($HE$124=4,$SV$319,IF($HE$124=5,$SV$320,IF($HE$124=6,$SV$321,IF($HE$124=7,$SV$322,0)))))))","v":"kg C2H4-eq"},{"$f":"VLOOKUP(HB122,$ST$316:$SV$322,2)","v":{"$error":"#N/A"}},{"$f":"VLOOKUP(HC122,$ST$316:$SV$322,2)","v":{"$error":"#N/A"}},null,{"$f":"Comp_LCA!H10","v":"Photochemical Ozone Creation Potential (POCP)"},null,null,null,null,null,{"$f":"GU123","v":"Gypsum Board (12,5 mm) [Gyptec]"},null,null,{"$f":"GX123","v":9.3999999999999997E-4},null,null,null,{"$f":"Comp_LCA!F18","v":"OSB (12 mm) [Kronospan]"},null,null,{"$f":"IF($HR$123=HK123,HN123,IF($HR$123=HK124,HN124,IF($HR$123=HK125,HN125,IF($HR$123=HK126,HN126,IF($HR$123=HK127,HN127,IF($HR$123=HK128,HN128,IF($HR$123=HK129,HN129,IF($HR$123=HK130,HN130,IF($HR$123=HK131,HN131,IF($HR$123=HK132,HN132,IF($HR$123=HK133,HN133,IF($HR$123=HK134,HN134,IF($HR$123=HK135,HN135,IF($HR$123=HK136,HN136,IF($HR$123=HK137,HN137,IF($HR$123=HK138,HN138,IF($HR$123=HK139,HN139,IF($HR$123=HK140,HN140,IF($HR$123=HK141,HN141,IF($HR$123=HK142,HN142,0))))))))))))))))))))","v":6.2640000000000005E-3}]
[null,null,null,null,null,null,null,null,null,null,null,null,null,null,null,null,null,null,null,null,null,null,null,null,null,null,null,null,null,null,null,null,null,null,null,null,null,null,null,null,null,null,null,null,null,null,null,null,null,null,null,null,null,null,"Guimarães",4,null,null,null,null,null,null,null,null,null,null,null,null,null,null,null,null,null,null,null,null,null,null,null,null,null,null,null,null,null,null,null,null,"Calheta",null,null,null,null,null,null,null,null,null,null,null,null,null,null,null,null,null,null,null,null,null,null,null,null,null,null,null,null,null,null,null,null,null,null,null,null,null,null,null,null,null,null,null,null,null,null,null,null,null,null,null,null,null,null,null,null,null,null,null,null,null,null,null,null,null,null,null,null,null,null,null,null,null,null,null,null,null,null,null,null,null,null,null,null,null,null,null,null,null,null,null,null,null,null,null,null,null,null,null,null,null,null,null,null,null,null,null,null,null,null,null,"LAYER 2",null,"OSB (12 mm) [Kronospan]",null,null,6.2640000000000005E-3,null,null,"kg C2H4-eq",{"$error":"#N/A"},{"$error":"#N/A"},null,{"$f":"VLOOKUP(HE123,$IM$166:$IN$172,2)","v":5},null,null,null,null,null,"OSB (12 mm) [Kronospan]",null,null,6.2640000000000005E-3]
[null,null,null,null,null,null,null,null,null,null,null,null,null,null,null,null,null,null,null,null,null,null,null,null,null,null,null,null,null,null,null,null,null,null,null,null,null,null,null,null,null,null,null,null,null,null,null,null,null,null,null,null,null,null,"Horta",29,null,null,null,null,null,null,null,null,null,null,null,null,null,null,null,null,null,null,null,null,null,null,null,null,null,null,null,null,null,null,null,null,"Calheta",null,null,null,null,null,null,null,null,null,null,null,null,null,null,null,null,null,null,null,null,null,null,null,null,null,null,null,null,null,null,null,null,null,null,null,null,null,null,null,null,null,null,null,null,null,null,null,null,null,null,null,null,null,null,null,null,null,null,null,null,null,null,null,null,null,null,null,null,null,null,null,null,null,null,null,null,null,null,null,null,null,null,null,null,null,null,null,null,null,null,null,null,null,null,null,null,null,null,null,null,null,null,null,null,null,null,null,null,null,null,null,"LAYER 3",null,"Mineral wool (90 mm) [Volcalis]",null,null,6.4619999999999999E-4,null,null,"kg C2H4-eq",{"$error":"#N/A"},{"$error":"#N/A"},null,null,null,null,null,null,null,"Mineral wool (90 mm) [Volcalis]",null,null,6.4619999999999999E-4]
[null,null,null,null,null,null,null,null,null,null,null,null,null,null,null,null,null,null,null,null,null,null,null,null,null,null,null,null,null,null,null,null,null,null,null,null,null,null,null,null,null,null,null,null,null,null,null,null,null,null,null,null,null,null,"Idanha-a-Nova",12,null,null,null,null,null,null,null,null,null,null,null,null,null,null,null,null,null,null,null,null,null,null,null,null,null,null,null,null,null,null,null,null,"Câmara de Lobos",null,null,null,null,null,null,null,null,null,null,null,null,null,null,null,null,null,null,null,null,null,null,null,null,null,null,null,null,null,null,null,null,null,null,null,null,null,null,null,null,null,null,null,null,null,null,null,null,null,null,null,null,null,null,null,null,null,null,null,null,null,null,null,null,null,null,null,null,null,null,null,null,null,null,null,null,null,null,null,null,null,null,null,null,null,null,null,null,null,null,null,null,null,null,null,null,null,null,null,null,null,null,null,null,null,null,null,null,null,null,null,"LAYER 4",null,"OSB (12 mm) [Kronospan]",null,null,6.2640000000000005E-3,null,null,"kg C2H4-eq",{"$error":"#N/A"},{"$error":"#N/A"},null,null,null,null,null,null,null,"OSB (12 mm) [Kronospan]",null,null,6.2640000000000005E-3]
[null,null,null,null,null,null,null,null,null,null,null,null,null,null,null,null,null,null,null,null,null,null,null,null,null,null,null,null,null,null,null,null,null,null,null,null,null,null,null,null,null,null,null,null,null,null,null,null,null,null,null,null,null,null,"Ílhavo",9,null,null,null,null,null,null,null,null,null,null,null,null,null,null,null,null,null,null,null,null,null,null,null,null,null,null,null,null,null,null,null,null,"Caminha",null,null,null,null,null,null,null,null,null,null,null,null,null,null,null,null,null,null,null,null,null,null,null,null,null,null,null,null,null,null,null,null,null,null,null,null,null,null,null,null,null,null,null,null,null,null,null,null,null,null,null,null,null,null,null,null,null,null,null,null,null,null,null,null,null,null,null,null,null,null,null,null,null,null,null,null,null,null,null,null,null,null,null,null,null,null,null,null,null,null,null,null,null,null,null,null,null,null,null,null,null,null,null,null,null,null,null,null,null,null,null,"LAYER 5",null,"Mortar (10 mm)",null,null,2.4499999999999999E-4,null,null,"kg C2H4-eq",{"$error":"#N/A"},{"$error":"#N/A"},null,null,null,null,null,null,null,"Mortar (10 mm)",null,null,2.4499999999999999E-4]
[null,null,null,null,null,null,null,null,null,null,null,null,null,null,null,null,null,null,null,null,null,null,null,null,null,null,null,null,null,null,null,null,null,null,null,null,null,null,null,null,null,null,null,null,null,null,null,null,null,null,null,null,null,null,"Lagoa - Algarve",28,null,null,null,null,null,null,null,null,null,null,null,null,null,null,null,null,null,null,null,null,null,null,null,null,null,null,null,null,null,null,null,null,"Campo Maior",null,null,null,null,null,null,null,null,null,null,null,null,null,null,null,null,null,null,null,null,null,null,null,null,null,null,null,null,null,null,null,null,null,null,null,null,null,null,null,null,null,null,null,null,null,null,null,null,null,null,null,null,null,null,null,null,null,null,null,null,null,null,null,null,null,null,null,null,null,null,null,null,null,null,null,null,null,null,null,null,null,null,null,null,null,null,null,null,null,null,null,null,null,null,null,null,null,null,null,null,null,null,null,null,null,null,null,null,null,null,null,"LAYER 6",null,"---",null,null,"---",null,null,"kg C2H4-eq",{"$error":"#N/A"},{"$error":"#N/A"},null,null,null,null,null,null,null,"---",null,null,"---"]
[null,null,null,null,null,null,null,null,null,null,null,null,null,null,null,null,null,null,null,null,null,null,null,null,null,null,null,null,null,null,null,null,null,null,null,null,null,null,null,null,null,null,null,null,null,null,null,null,null,null,null,null,null,null,"Lagoa - Açores",29,null,null,null,null,null,null,null,null,null,null,null,null,null,null,null,null,null,null,null,null,null,null,null,null,null,null,null,null,null,null,null,null,"Cantanhede",null,null,null,null,null,null,null,null,null,null,null,null,null,null,null,null,null,null,null,null,null,null,null,null,null,null,null,null,null,null,null,null,null,null,null,null,null,null,null,null,null,null,null,null,null,null,null,null,null,null,null,null,null,null,null,null,null,null,null,null,null,null,null,null,null,null,null,null,null,null,null,null,null,null,null,null,null,null,null,null,null,null,null,null,null,null,null,null,null,null,null,null,null,null,null,null,null,null,null,null,null,null,null,null,null,null,null,null,null,null,null,"LAYER 7",null,"---",null,null,"---",null,null,"kg C2H4-eq",{"$error":"#N/A"},{"$error":"#N/A"},null,null,null,null,null,null,null,"---",null,null,"---"]
[null,null,null,null,null,null,null,null,null,null,null,null,null,null,null,null,null,null,null,null,null,null,null,null,null,null,null,null,null,null,null,null,null,null,null,null,null,null,null,null,null,null,null,null,null,null,null,null,null,null,null,null,null,null,"Lagos",28,null,null,null,null,null,null,null,null,null,null,null,null,null,null,null,null,null,null,null,null,null,null,null,null,null,null,null,null,null,null,null,null,"Carrazeda de Ansiães",null,null,null,null,null,null,null,null,null,null,null,null,null,null,null,null,null,null,null,null,null,null,null,null,null,null,null,null,null,null,null,null,null,null,null,null,null,null,null,null,null,null,null,null,null,null,null,null,null,null,null,null,null,null,null,null,null,null,null,null,null,null,null,null,null,null,null,null,null,null,null,null,null,null,null,null,null,null,null,null,null,null,null,null,null,null,null,null,null,null,null,null,null,null,null,null,null,null,null,null,null,null,null,null,null,null,null,null,null,null,null,"LAYER 8",null,"---",null,null,"---",null,null,"kg C2H4-eq",{"$error":"#N/A"},{"$error":"#N/A"},null,null,null,null,null,null,null,"---",null,null,"---"]
[null,null,null,null,null,null,null,null,null,null,null,null,null,null,null,null,null,null,null,null,null,null,null,null,null,null,null,null,null,null,null,null,null,null,null,null,null,null,null,null,null,null,null,null,null,null,null,null,null,null,null,null,null,null,"Lajes das Flores",29,null,null,null,null,null,null,null,null,null,null,null,null,null,null,null,null,null,null,null,null,null,null,null,null,null,null,null,null,null,null,null,null,"Carregal do Sal",null,null,null,null,null,null,null,null,null,null,null,null,null,null,null,null,null,null,null,null,null,null,null,null,null,null,null,null,null,null,null,null,null,null,null,null,null,null,null,null,null,null,null,null,null,null,null,null,null,null,null,null,null,null,null,null,null,null,null,null,null,null,null,null,null,null,null,null,null,null,null,null,null,null,null,null,null,null,null,null,null,null,null,null,null,null,null,null,null,null,null,null,null,null,null,null,null,null,null,null,null,null,null,null,null,null,null,null,null,null,null,"LAYER 9",null,"---",null,null,"---",null,null,"kg C2H4-eq",{"$error":"#N/A"},{"$error":"#N/A"},null,null,null,null,null,null,null,"---",null,null,"---"]
[null,null,null,null,null,null,null,null,null,null,null,null,null,null,null,null,null,null,null,null,null,null,null,null,null,null,null,null,null,null,null,null,null,null,null,null,null,null,null,null,null,null,null,null,null,null,null,null,null,null,null,null,null,null,"Lajes do Pico",29,null,null,null,null,null,null,null,null,null,null,null,null,null,null,null,null,null,null,null,null,null,null,null,null,null,null,null,null,null,null,null,null,"Cartaxo",null,null,null,null,null,null,null,null,null,null,null,null,null,null,null,null,null,null,null,null,null,null,null,null,null,null,null,null,null,null,null,null,null,null,null,null,null,null,null,null,null,null,null,null,null,null,null,null,null,null,null,null,null,null,null,null,null,null,null,null,null,null,null,null,null,null,null,null,null,null,null,null,null,null,null,null,null,null,null,null,null,null,null,null,null,null,null,null,null,null,null,null,null,null,null,null,null,null,null,null,null,null,null,null,null,null,null,null,null,null,null,"LAYER 10",null,"---",null,null,"---",null,null,"kg C2H4-eq",{"$error":"#N/A"},{"$error":"#N/A"},null,null,null,null,null,null,null,"---",null,null,"---"]
[null,null,null,null,null,null,null,null,null,null,null,null,null,null,null,null,null,null,null,null,null,null,null,null,null,null,null,null,null,null,null,null,null,null,null,null,null,null,null,null,null,null,null,null,null,null,null,null,null,null,null,null,null,null,"Lamego",7,null,null,null,null,null,null,null,null,null,null,null,null,null,null,null,null,null,null,null,null,null,null,null,null,null,null,null,null,null,null,null,null,"Cascais",null,null,null,null,null,null,null,null,null,null,null,null,null,null,null,null,null,null,null,null,null,null,null,null,null,null,null,null,null,null,null,null,null,null,null,null,null,null,null,null,null,null,null,null,null,null,null,null,null,null,null,null,null,null,null,null,null,null,null,null,null,null,null,null,null,null,null,null,null,null,null,null,null,null,null,null,null,null,null,null,null,null,null,null,null,null,null,null,null,null,null,null,null,null,null,null,null,null,null,null,null,null,null,null,null,null,null,null,null,null,null,null,null,"Material 2",null,null,"Indicator",null,null,null,null,null,null,null,null,null,null,null,null,{"$f":"GU134","v":"---"},null,null,{"$f":"GX134","v":"---"}]
[null,null,null,null,null,null,null,null,null,null,null,null,null,null,null,null,null,null,null,null,null,null,null,null,null,null,null,null,null,null,null,null,null,null,null,null,null,null,null,null,null,null,null,null,null,null,null,null,null,null,null,null,null,null,"Leiria",18,null,null,null,null,null,null,null,null,null,null,null,null,null,null,null,null,null,null,null,null,null,null,null,null,null,null,null,null,null,null,null,null,"Castanheira de Pera",null,null,null,null,null,null,null,null,null,null,null,null,null,null,null,null,null,null,null,null,null,null,null,null,null,null,null,null,null,null,null,null,null,null,null,null,null,null,null,null,null,null,null,null,null,null,null,null,null,null,null,null,null,null,null,null,null,null,null,null,null,null,null,null,null,null,null,null,null,null,null,null,null,null,null,null,null,null,null,null,null,null,null,null,null,null,null,null,null,null,null,null,null,null,null,null,null,null,null,null,null,null,null,null,null,null,null,null,null,null,null,"LAYER 1",null,{"$f":"GU77","v":"---"},null,null,{"$f":"IF($HE$124=1,HD23,IF($HE$124=2,HJ23,IF($HE$124=3,HP23,IF($HE$124=4,HV23,IF($HE$124=5,IB23,IF($HE$124=6,IH23,IF($HE$124=7,IN23,0)))))))","v":"---"},null,null,{"$f":"IF($HE$124=1,$SV$316,IF($HE$124=2,$SV$317,IF($HE$124=3,$SV$318,IF($HE$124=4,$SV$319,IF($HE$124=5,$SV$320,IF($HE$124=6,$SV$321,IF($HE$124=7,$SV$322,0)))))))","v":"kg C2H4-eq"},{"$f":"VLOOKUP(HB133,$ST$316:$SV$322,2)","v":{"$error":"#N/A"}},{"$f":"VLOOKUP(HC133,$ST$316:$SV$322,2)","v":{"$error":"#N/A"}},null,null,null,null,null,null,null,"---",null,null,"---"]
[null,null,null,null,null,null,null,null,null,null,null,null,null,null,null,null,null,null,null,null,null,null,null,null,null,null,null,null,null,null,null,null,null,null,null,null,null,null,null,null,null,null,null,null,null,null,null,null,null,null,null,null,null,null,"Lisboa",22,null,null,null,null,null,null,null,null,null,null,null,null,null,null,null,null,null,null,null,null,null,null,null,null,null,null,null,null,null,null,null,null,"Castelo Branco",null,null,null,null,null,null,null,null,null,null,null,null,null,null,null,null,null,null,null,null,null,null,null,null,null,null,null,null,null,null,null,null,null,null,null,null,null,null,null,null,null,null,null,null,null,null,null,null,null,null,null,null,null,null,null,null,null,null,null,null,null,null,null,null,null,null,null,null,null,null,null,null,null,null,null,null,null,null,null,null,null,null,null,null,null,null,null,null,null,null,null,null,null,null,null,null,null,null,null,null,null,null,null,null,null,null,null,null,null,null,null,"LAYER 2",null,"---",null,null,"---",null,null,"kg C2H4-eq",{"$error":"#N/A"},{"$error":"#N/A"},null,null,null,null,null,null,null,"Steel C90/U93 (90 mm) [Pertecno]",null,null,4.6603460000000003E-4]
[null,null,null,null,null,null,null,null,null,null,null,null,null,null,null,null,null,null,null,null,null,null,null,null,null,null,null,null,null,null,null,null,null,null,null,null,null,null,null,null,null,null,null,null,null,null,null,null,null,null,null,null,null,null,"Loulé",28,null,null,null,null,null,null,null,null,null,null,null,null,null,null,null,null,null,null,null,null,null,null,null,null,null,null,null,null,null,null,null,null,"Castelo de Paiva",null,null,null,null,null,null,null,null,null,null,null,null,null,null,null,null,null,null,null,null,null,null,null,null,null,null,null,null,null,null,null,null,null,null,null,null,null,null,null,null,null,null,null,null,null,null,null,null,null,null,null,null,null,null,null,null,null,null,null,null,null,null,null,null,null,null,null,null,null,null,null,null,null,null,null,null,null,null,null,null,null,null,null,null,null,null,null,null,null,null,null,null,null,null,null,null,null,null,null,null,null,null,null,null,null,null,null,null,null,null,null,"LAYER 3",null,"Steel C90/U93 (90 mm) [Pertecno]",null,null,4.6603460000000003E-4,null,null,"kg C2H4-eq",{"$error":"#N/A"},{"$error":"#N/A"},null,null,null,null,null,null,null,"---",null,null,"---"]
[null,null,null,null,null,null,null,null,null,null,null,null,null,null,null,null,null,null,null,null,null,null,null,null,null,null,null,null,null,null,null,null,null,null,null,null,null,null,null,null,null,null,null,null,null,null,null,null,null,null,null,null,null,null,"Loures",22,null,null,null,null,null,null,null,null,null,null,null,null,null,null,null,null,null,null,null,null,null,null,null,null,null,null,null,null,null,null,null,null,"Castelo de Vide",null,null,null,null,null,null,null,null,null,null,null,null,null,null,null,null,null,null,null,null,null,null,null,null,null,null,null,null,null,null,null,null,null,null,null,null,null,null,null,null,null,null,null,null,null,null,null,null,null,null,null,null,null,null,null,null,null,null,null,null,null,null,null,null,null,null,null,null,null,null,null,null,null,null,null,null,null,null,null,null,null,null,null,null,null,null,null,null,null,null,null,null,null,null,null,null,null,null,null,null,null,null,null,null,null,null,null,null,null,null,null,"LAYER 4",null,"---",null,null,"---",null,null,"kg C2H4-eq",{"$error":"#N/A"},{"$error":"#N/A"},null,null,null,null,null,null,null,"---",null,null,"---"]
[null,null,null,null,null,null,null,null,null,null,null,null,null,null,null,null,null,null,null,null,null,null,null,null,null,null,null,null,null,null,null,null,null,null,null,null,null,null,null,null,null,null,null,null,null,null,null,null,null,null,null,null,null,null,"Lourinhã",19,null,null,null,null,null,null,null,null,null,null,null,null,null,null,null,null,null,null,null,null,null,null,null,null,null,null,null,null,null,null,null,null,"Castro Daire",null,null,null,null,null,null,null,null,null,null,null,null,null,null,null,null,null,null,null,null,null,null,null,null,null,null,null,null,null,null,null,null,null,null,null,null,null,null,null,null,null,null,null,null,null,null,null,null,null,null,null,null,null,null,null,null,null,null,null,null,null,null,null,null,null,null,null,null,null,null,null,null,null,null,null,null,null,null,null,null,null,null,null,null,null,null,null,null,null,null,null,null,null,null,null,null,null,null,null,null,null,null,null,null,null,null,null,null,null,null,null,"LAYER 5",null,"---",null,null,"---",null,null,"kg C2H4-eq",{"$error":"#N/A"},{"$error":"#N/A"},null,null,null,null,null,null,null,"---",null,null,"---"]
[null,null,null,null,null,null,null,null,null,null,null,null,null,null,null,null,null,null,null,null,null,null,null,null,null,null,null,null,null,null,null,null,null,null,null,null,null,null,null,null,null,null,null,null,null,null,null,null,null,null,null,null,null,null,"Lousã",16,null,null,null,null,null,null,null,null,null,null,null,null,null,null,null,null,null,null,null,null,null,null,null,null,null,null,null,null,null,null,null,null,"Castro Marim",null,null,null,null,null,null,null,null,null,null,null,null,null,null,null,null,null,null,null,null,null,null,null,null,null,null,null,null,null,null,null,null,null,null,null,null,null,null,null,null,null,null,null,null,null,null,null,null,null,null,null,null,null,null,null,null,null,null,null,null,null,null,null,null,null,null,null,null,null,null,null,null,null,null,null,null,null,null,null,null,null,null,null,null,null,null,null,null,null,null,null,null,null,null,null,null,null,null,null,null,null,null,null,null,null,null,null,null,null,null,null,"LAYER 6",null,"---",null,null,"---",null,null,"kg C2H4-eq",{"$error":"#N/A"},{"$error":"#N/A"},null,null,null,null,null,null,null,"---",null,null,"---"]
[null,null,null,null,null,null,null,null,null,null,null,null,null,null,null,null,null,null,null,null,null,null,null,null,null,null,null,null,null,null,null,null,null,null,null,null,null,null,null,null,null,null,null,null,null,null,null,null,null,null,null,null,null,null,"Lousada",6,null,null,null,null,null,null,null,null,null,null,null,null,null,null,null,null,null,null,null,null,null,null,null,null,null,null,null,null,null,null,null,null,"Castro Verde",null,null,null,null,null,null,null,null,null,null,null,null,null,null,null,null,null,null,null,null,null,null,null,null,null,null,null,null,null,null,null,null,null,null,null,null,null,null,null,null,null,null,null,null,null,null,null,null,null,null,null,null,null,null,null,null,null,null,null,null,null,null,null,null,null,null,null,null,null,null,null,null,null,null,null,null,null,null,null,null,null,null,null,null,null,null,null,null,null,null,null,null,null,null,null,null,null,null,null,null,null,null,null,null,null,null,null,null,null,null,null,"LAYER 7",null,"---",null,null,"---",null,null,"kg C2H4-eq",{"$error":"#N/A"},{"$error":"#N/A"},null,null,null,null,null,null,null,"---",null,null,"---"]
[null,null,null,null,null,null,null,null,null,null,null,null,null,null,null,null,null,null,null,null,null,null,null,null,null,null,null,null,null,null,null,null,null,null,null,null,null,null,null,null,null,null,null,null,null,null,null,null,null,null,null,null,null,null,"Mação",20,null,null,null,null,null,null,null,null,null,null,null,null,null,null,null,null,null,null,null,null,null,null,null,null,null,null,null,null,null,null,null,null,"Celorico da Beira",null,null,null,null,null,null,null,null,null,null,null,null,null,null,null,null,null,null,null,null,null,null,null,null,null,null,null,null,null,null,null,null,null,null,null,null,null,null,null,null,null,null,null,null,null,null,null,null,null,null,null,null,null,null,null,null,null,null,null,null,null,null,null,null,null,null,null,null,null,null,null,null,null,null,null,null,null,null,null,null,null,null,null,null,null,null,null,null,null,null,null,null,null,null,null,null,null,null,null,null,null,null,null,null,null,null,null,null,null,null,null,"LAYER 8",null,"---",null,null,"---",null,null,"kg C2H4-eq",{"$error":"#N/A"},{"$error":"#N/A"},null,null,null,null,null,null,null,"---",null,null,"---"]
[null,null,null,null,null,null,null,null,null,null,null,null,null,null,null,null,null,null,null,null,null,null,null,null,null,null,null,null,null,null,null,null,null,null,null,null,null,null,null,null,null,null,null,null,null,null,null,null,null,null,null,null,null,null,"Macedo de Cavaleiros",2,null,null,null,null,null,null,null,null,null,null,null,null,null,null,null,null,null,null,null,null,null,null,null,null,null,null,null,null,null,null,null,null,"Celorico de Basto",null,null,null,null,null,null,null,null,null,null,null,null,null,null,null,null,null,null,null,null,null,null,null,null,null,null,null,null,null,null,null,null,null,null,null,null,null,null,null,null,null,null,null,null,null,null,null,null,null,null,null,null,null,null,null,null,null,null,null,null,null,null,null,null,null,null,null,null,null,null,null,null,null,null,null,null,null,null,null,null,null,null,null,null,null,null,null,null,null,null,null,null,null,null,null,null,null,null,null,null,null,null,null,null,null,null,null,null,null,null,null,"LAYER 9",null,"---",null,null,"---",null,null,"kg C2H4-eq",{"$error":"#N/A"},{"$error":"#N/A"},null,null,null,null,null,null,null,"---",null,null,"---"]
[null,null,null,null,null,null,null,null,null,null,null,null,null,null,null,null,null,null,null,null,null,null,null,null,null,null,null,null,null,null,null,null,null,null,null,null,null,null,null,null,null,null,null,null,null,null,null,null,null,null,null,null,null,null,"Machico",30,null,null,null,null,null,null,null,null,null,null,null,null,null,null,null,null,null,null,null,null,null,null,null,null,null,null,null,null,null,null,null,null,"Chamusca",null,null,null,null,null,null,null,null,null,null,null,null,null,null,null,null,null,null,null,null,null,null,null,null,null,null,null,null,null,null,null,null,null,null,null,null,null,null,null,null,null,null,null,null,null,null,null,null,null,null,null,null,null,null,null,null,null,null,null,null,null,null,null,null,null,null,null,null,null,null,null,null,null,null,null,null,null,null,null,null,null,null,null,null,null,null,null,null,null,null,null,null,null,null,null,null,null,null,null,null,null,null,null,null,null,null,null,null,null,null,null,"LAYER 10",null,"---",null,null,"---",null,null,"kg C2H4-eq",{"$error":"#N/A"},{"$error":"#N/A"}]
[null,null,null,null,null,null,null,null,null,null,null,null,null,null,null,null,null,null,null,null,null,null,null,null,null,null,null,null,null,null,null,null,null,null,null,null,null,null,null,null,null,null,null,null,null,null,null,null,null,null,null,null,null,null,"Madalena",29,null,null,null,null,null,null,null,null,null,null,null,null,null,null,null,null,null,null,null,null,null,null,null,null,null,null,null,null,null,null,null,null,"Chaves",null,null,null,null,null,null,null,null,null,null,null,null,null,null,null,null,null,null,null,null,null,null,null,null,null,null,null,null,null,null,null,null,null,null,null,null,null,null,null,null,null,null,null,null,null,null,null,null,null,null,null,null,null,null,null,null,null,null,null,null,null,null,null,null,null,null,null,null,null,null,null,null,null,null,null,null,null,null,null,null,null,null,null,null,null,null,null,null,null,null,null,null,null,null,null,null,null,null,null,null,null,null,null,null,null,null,null,null,null,null,null,null,null,"TOTAL",null,null,{"$f":"SUM(GX123:GZ132)+SUM(GX134:GZ143)","v":1.4825234600000001E-2}]
[null,null,null,null,null,null,null,null,null,null,null,null,null,null,null,null,null,null,null,null,null,null,null,null,null,null,null,null,null,null,null,null,null,null,null,null,null,null,null,null,null,null,null,null,null,null,null,null,null,null,null,null,null,null,"Mafra",22,null,null,null,null,null,null,null,null,null,null,null,null,null,null,null,null,null,null,null,null,null,null,null,null,null,null,null,null,null,null,null,null,"Cinfães"]
[null,null,null,null,null,null,null,null,null,null,null,null,null,null,null,null,null,null,null,null,null,null,null,null,null,null,null,null,null,null,null,null,null,null,null,null,null,null,null,null,null,null,null,null,null,null,null,null,null,null,null,null,null,null,"Maia",5,null,null,null,null,null,null,null,null,null,null,null,null,null,null,null,null,null,null,null,null,null,null,null,null,null,null,null,null,null,null,null,null,"Coimbra"]
[null,null,null,null,null,null,null,null,null,null,null,null,null,null,null,null,null,null,null,null,null,null,null,null,null,null,null,null,null,null,null,null,null,null,null,null,null,null,null,null,null,null,null,null,null,null,null,null,null,null,null,null,null,null,"Mangualde",15,null,null,null,null,null,null,null,null,null,null,null,null,null,null,null,null,null,null,null,null,null,null,null,null,null,null,null,null,null,null,null,null,"Condeixa-a-Nova",null,null,null,null,null,null,null,null,null,null,null,null,null,null,null,null,null,null,null,null,null,null,null,null,null,null,null,null,null,null,null,null,null,null,null,null,null,null,null,null,null,null,null,null,null,null,null,null,null,null,null,null,null,null,null,null,null,null,null,null,null,null,null,null,null,null,null,null,null,null,null,null,null,null,null,null,null,null,null,null,null,null,null,null,null,null,null,null,null,null,null,null,null,null,null,null,null,null,null,null,null,null,null,null,null,null,null,null,null,null,null,"GLOBAL B"]
[null,null,null,null,null,null,null,null,null,null,null,null,null,null,null,null,null,null,null,null,null,null,null,null,null,null,null,null,null,null,null,null,null,null,null,null,null,null,null,null,null,null,null,null,null,null,null,null,null,null,null,null,null,null,"Manteigas",11,null,null,null,null,null,null,null,null,null,null,null,null,null,null,null,null,null,null,null,null,null,null,null,null,null,null,null,null,null,null,null,null,"Constância"]
[null,null,null,null,null,null,null,null,null,null,null,null,null,null,null,null,null,null,null,null,null,null,null,null,null,null,null,null,null,null,null,null,null,null,null,null,null,null,null,null,null,null,null,null,null,null,null,null,null,null,null,null,null,null,"Marco de Canaveses",6,null,null,null,null,null,null,null,null,null,null,null,null,null,null,null,null,null,null,null,null,null,null,null,null,null,null,null,null,null,null,null,null,"Coruche",null,null,null,null,null,null,null,null,null,null,null,null,null,null,null,null,null,null,null,null,null,null,null,null,null,null,null,null,null,null,null,null,null,null,null,null,null,null,null,null,null,null,null,null,null,null,null,null,null,null,null,null,null,null,null,null,null,null,null,null,null,null,null,null,null,null,null,null,null,null,null,null,null,null,null,null,null,null,null,null,null,null,null,null,null,null,null,null,null,null,null,null,null,null,null,null,null,null,null,null,null,null,null,null,null,null,null,null,null,null,null,null,null,null,null,null,null,null,null,null,null,null,null,null,null,null,null,null,null,"SOLUTION B (COMPONENTS)",null,null,null,null,null,null,"SOLUTION B (CHOSEN COMPONENT)"]
[null,null,null,null,null,null,null,null,null,null,null,null,null,null,null,null,null,null,null,null,null,null,null,null,null,null,null,null,null,null,null,null,null,null,null,null,null,null,null,null,null,null,null,null,null,null,null,null,null,null,null,null,null,null,"Marinha Grande",18,null,null,null,null,null,null,null,null,null,null,null,null,null,null,null,null,null,null,null,null,null,null,null,null,null,null,null,null,null,null,null,null,"Covilhã",null,null,null,null,null,null,null,null,null,null,null,null,null,null,null,null,null,null,null,null,null,null,null,null,null,null,null,null,null,null,null,null,null,null,null,null,null,null,null,null,null,null,null,null,null,null,null,null,null,null,null,null,null,null,null,null,null,null,null,null,null,null,null,null,null,null,null,null,null,null,null,null,null,null,null,null,null,null,null,null,null,null,null,null,null,null,null,null,null,null,null,null,null,null,null,null,null,null,null,null,null,null,null,null,null,null,null,null,null,null,null,"Layers",null,"Material 1",null,null,"Indicator",null,null,null,null,null,null,"Chosen Indicator"]
[null,null,null,null,null,null,null,null,null,null,null,null,null,null,null,null,null,null,null,null,null,null,null,null,null,null,null,null,null,null,null,null,null,null,null,null,null,null,null,null,null,null,null,null,null,null,null,null,null,null,null,null,null,null,"Marvão",24,null,null,null,null,null,null,null,null,null,null,null,null,null,null,null,null,null,null,null,null,null,null,null,null,null,null,null,null,null,null,null,null,"Crato",null,null,null,null,null,null,null,null,null,null,null,null,null,null,null,null,null,null,null,null,null,null,null,null,null,null,null,null,null,null,null,null,null,null,null,null,null,null,null,null,null,null,null,null,null,null,null,null,null,null,null,null,null,null,null,null,null,null,null,null,null,null,null,null,null,null,null,null,null,null,null,null,null,null,null,null,null,null,null,null,null,null,null,null,null,null,null,null,null,null,null,null,null,null,null,null,null,null,null,null,null,null,null,null,null,null,null,null,null,null,null,"LAYER 1",null,{"$f":"GU94","v":"Gypsum Board (12,5 mm) [Gyptec]"},null,null,{"$f":"IF($HE$152=1,HD39,IF($HE$152=2,HJ39,IF($HE$152=3,HP39,IF($HE$152=4,HV39,IF($HE$152=5,IB39,IF($HE$152=6,IH39,IF($HE$152=7,IN39,0)))))))","v":9.3999999999999997E-4},null,null,{"$f":"IF($HE$152=1,$SV$316,IF($HE$152=2,$SV$317,IF($HE$152=3,$SV$318,IF($HE$152=4,$SV$319,IF($HE$152=5,$SV$320,IF($HE$152=6,$SV$321,IF($HE$152=7,$SV$322,0)))))))","v":"kg C2H4-eq"},{"$f":"VLOOKUP(HB150,$ST$316:$SV$322,2)","v":{"$error":"#N/A"}},{"$f":"VLOOKUP(HC150,$ST$316:$SV$322,2)","v":{"$error":"#N/A"}},null,{"$f":"HE123","v":"Photochemical Ozone Creation Potential (POCP)"},null,null,null,null,null,{"$f":"GU151","v":"Gypsum Board (12,5 mm) [Gyptec]"},null,null,{"$f":"GX151","v":9.3999999999999997E-4},null,null,null,{"$f":"Comp_LCA!F24","v":"OSB (12 mm) [Kronospan]"},null,null,{"$f":"IF($HR$151=HK151,HN151,IF($HR$151=HK152,HN152,IF($HR$151=HK153,HN153,IF($HR$151=HK154,HN154,IF($HR$151=HK155,HN155,IF($HR$151=HK156,HN156,IF($HR$151=HK157,HN157,IF($HR$151=HK158,HN158,IF($HR$151=HK159,HN159,IF($HR$151=HK160,HN160,IF($HR$151=HK161,HN161,IF($HR$151=HK162,HN162,IF($HR$151=HK163,HN163,IF($HR$151=HK164,HN164,IF($HR$151=HK165,HN165,IF($HR$151=HK166,HN166,IF($HR$151=HK167,HN167,IF($HR$151=HK168,HN168,IF($HR$151=HK169,HN169,IF($HR$151=HK170,HN170,0))))))))))))))))))))","v":6.2640000000000005E-3}]
[null,null,null,null,null,null,null,null,null,null,null,null,null,null,null,null,null,null,null,null,null,null,null,null,null,null,null,null,null,null,null,null,null,null,null,null,null,null,null,null,null,null,null,null,null,null,null,null,null,null,null,null,null,null,"Matosinhos",5,null,null,null,null,null,null,null,null,null,null,null,null,null,null,null,null,null,null,null,null,null,null,null,null,null,null,null,null,null,null,null,null,"Cuba",null,null,null,null,null,null,null,null,null,null,null,null,null,null,null,null,null,null,null,null,null,null,null,null,null,null,null,null,null,null,null,null,null,null,null,null,null,null,null,null,null,null,null,null,null,null,null,null,null,null,null,null,null,null,null,null,null,null,null,null,null,null,null,null,null,null,null,null,null,null,null,null,null,null,null,null,null,null,null,null,null,null,null,null,null,null,null,null,null,null,null,null,null,null,null,null,null,null,null,null,null,null,null,null,null,null,null,null,null,null,null,"LAYER 2",null,"OSB (12 mm) [Kronospan]",null,null,6.2640000000000005E-3,null,null,"kg C2H4-eq",{"$error":"#N/A"},{"$error":"#N/A"},null,{"$f":"HE124","v":5},null,null,null,null,null,"OSB (12 mm) [Kronospan]",null,null,6.2640000000000005E-3]
[null,null,null,null,null,null,null,null,null,null,null,null,null,null,null,null,null,null,null,null,null,null,null,null,null,null,null,null,null,null,null,null,null,null,null,null,null,null,null,null,null,null,null,null,null,null,null,null,null,null,null,null,null,null,"Mealhada",10,null,null,null,null,null,null,null,null,null,null,null,null,null,null,null,null,null,null,null,null,null,null,null,null,null,null,null,null,null,null,null,null,"Elvas",null,null,null,null,null,null,null,null,null,null,null,null,null,null,null,null,null,null,null,null,null,null,null,null,null,null,null,null,null,null,null,null,null,null,null,null,null,null,null,null,null,null,null,null,null,null,null,null,null,null,null,null,null,null,null,null,null,null,null,null,null,null,null,null,null,null,null,null,null,null,null,null,null,null,null,null,null,null,null,null,null,null,null,null,null,null,null,null,null,null,null,null,null,null,null,null,null,null,null,null,null,null,null,null,null,null,null,null,null,null,null,"LAYER 3",null,"Air Cavity (10 mm) [ISO 6946]",null,null,0,null,null,"kg C2H4-eq",{"$error":"#N/A"},{"$error":"#N/A"},null,null,null,null,null,null,null,"Air Cavity (10 mm) [ISO 6946]",null,null,0]
[null,null,null,null,null,null,null,null,null,null,null,null,null,null,null,null,null,null,null,null,null,null,null,null,null,null,null,null,null,null,null,null,null,null,null,null,null,null,null,null,null,null,null,null,null,null,null,null,null,null,null,null,null,null,"Mêda",11,null,null,null,null,null,null,null,null,null,null,null,null,null,null,null,null,null,null,null,null,null,null,null,null,null,null,null,null,null,null,null,null,"Entroncamento",null,null,null,null,null,null,null,null,null,null,null,null,null,null,null,null,null,null,null,null,null,null,null,null,null,null,null,null,null,null,null,null,null,null,null,null,null,null,null,null,null,null,null,null,null,null,null,null,null,null,null,null,null,null,null,null,null,null,null,null,null,null,null,null,null,null,null,null,null,null,null,null,null,null,null,null,null,null,null,null,null,null,null,null,null,null,null,null,null,null,null,null,null,null,null,null,null,null,null,null,null,null,null,null,null,null,null,null,null,null,null,"LAYER 4",null,"Mineral wool (90 mm) [Volcalis]",null,null,6.4619999999999999E-4,null,null,"kg C2H4-eq",{"$error":"#N/A"},{"$error":"#N/A"},null,null,null,null,null,null,null,"Mineral wool (90 mm) [Volcalis]",null,null,6.4619999999999999E-4]
[null,null,null,null,null,null,null,null,null,null,null,null,null,null,null,null,null,null,null,null,null,null,null,null,null,null,null,null,null,null,null,null,null,null,null,null,null,null,null,null,null,null,null,null,null,null,null,null,null,null,null,null,null,null,"Melgaço",1,null,null,null,null,null,null,null,null,null,null,null,null,null,null,null,null,null,null,null,null,null,null,null,null,null,null,null,null,null,null,null,null,"Espinho",null,null,null,null,null,null,null,null,null,null,null,null,null,null,null,null,null,null,null,null,null,null,null,null,null,null,null,null,null,null,null,null,null,null,null,null,null,null,null,null,null,null,null,null,null,null,null,null,null,null,null,null,null,null,null,null,null,null,null,null,null,null,null,null,null,null,null,null,null,null,null,null,null,null,null,null,null,null,null,null,null,null,null,null,null,null,null,null,null,null,null,null,null,null,null,null,null,null,null,null,null,null,null,null,null,null,null,null,null,null,null,"LAYER 5",null,"Air Cavity (10 mm) [ISO 6946]",null,null,0,null,null,"kg C2H4-eq",{"$error":"#N/A"},{"$error":"#N/A"},null,null,null,null,null,null,null,"Air Cavity (10 mm) [ISO 6946]",null,null,0]
[null,null,null,null,null,null,null,null,null,null,null,null,null,null,null,null,null,null,null,null,null,null,null,null,null,null,null,null,null,null,null,null,null,null,null,null,null,null,null,null,null,null,null,null,null,null,null,null,null,null,null,null,null,null,"Mértola",27,null,null,null,null,null,null,null,null,null,null,null,null,null,null,null,null,null,null,null,null,null,null,null,null,null,null,null,null,null,null,null,null,"Esposende",null,null,null,null,null,null,null,null,null,null,null,null,null,null,null,null,null,null,null,null,null,null,null,null,null,null,null,null,null,null,null,null,null,null,null,null,null,null,null,null,null,null,null,null,null,null,null,null,null,null,null,null,null,null,null,null,null,null,null,null,null,null,null,null,null,null,null,null,null,null,null,null,null,null,null,null,null,null,null,null,null,null,null,null,null,null,null,null,null,null,null,null,null,null,null,null,null,null,null,null,null,null,null,null,null,null,null,null,null,null,null,"LAYER 6",null,"OSB (12 mm) [Kronospan]",null,null,6.2640000000000005E-3,null,null,"kg C2H4-eq",{"$error":"#N/A"},{"$error":"#N/A"},null,null,null,null,null,null,null,"OSB (12 mm) [Kronospan]",null,null,6.2640000000000005E-3]
[null,null,null,null,null,null,null,null,null,null,null,null,null,null,null,null,null,null,null,null,null,null,null,null,null,null,null,null,null,null,null,null,null,null,null,null,null,null,null,null,null,null,null,null,null,null,null,null,null,null,null,null,null,null,"Mesão Frio",7,null,null,null,null,null,null,null,null,null,null,null,null,null,null,null,null,null,null,null,null,null,null,null,null,null,null,null,null,null,null,null,null,"Estarreja",null,null,null,null,null,null,null,null,null,null,null,null,null,null,null,null,null,null,null,null,null,null,null,null,null,null,null,null,null,null,null,null,null,null,null,null,null,null,null,null,null,null,null,null,null,null,null,null,null,null,null,null,null,null,null,null,null,null,null,null,null,null,null,null,null,null,null,null,null,null,null,null,null,null,null,null,null,null,null,null,null,null,null,null,null,null,null,null,null,null,null,null,null,null,null,null,null,null,null,null,null,null,null,null,null,null,null,null,null,null,null,"LAYER 7",null,"Mortar (10 mm)",null,null,2.4499999999999999E-4,null,null,"kg C2H4-eq",{"$error":"#N/A"},{"$error":"#N/A"},null,null,null,null,null,null,null,"Mortar (10 mm)",null,null,2.4499999999999999E-4]
[null,null,null,null,null,null,null,null,null,null,null,null,null,null,null,null,null,null,null,null,null,null,null,null,null,null,null,null,null,null,null,null,null,null,null,null,null,null,null,null,null,null,null,null,null,null,null,null,null,null,null,null,null,null,"Mira",10,null,null,null,null,null,null,null,null,null,null,null,null,null,null,null,null,null,null,null,null,null,null,null,null,null,null,null,null,null,null,null,null,"Estremoz",null,null,null,null,null,null,null,null,null,null,null,null,null,null,null,null,null,null,null,null,null,null,null,null,null,null,null,null,null,null,null,null,null,null,null,null,null,null,null,null,null,null,null,null,null,null,null,null,null,null,null,null,null,null,null,null,null,null,null,null,null,null,null,null,null,null,null,null,null,null,null,null,null,null,null,null,null,null,null,null,null,null,null,null,null,null,null,null,null,null,null,null,null,null,null,null,null,null,null,null,null,null,null,null,null,null,null,null,null,null,null,"LAYER 8",null,"---",null,null,"---",null,null,"kg C2H4-eq",{"$error":"#N/A"},{"$error":"#N/A"},null,null,null,null,null,null,null,"---",null,null,"---"]
[null,null,null,null,null,null,null,null,null,null,null,null,null,null,null,null,null,null,null,null,null,null,null,null,null,null,null,null,null,null,null,null,null,null,null,null,null,null,null,null,null,null,null,null,null,null,null,null,null,null,null,null,null,null,"Miranda do Corvo",16,null,null,null,null,null,null,null,null,null,null,null,null,null,null,null,null,null,null,null,null,null,null,null,null,null,null,null,null,null,null,null,null,"Évora",null,null,null,null,null,null,null,null,null,null,null,null,null,null,null,null,null,null,null,null,null,null,null,null,null,null,null,null,null,null,null,null,null,null,null,null,null,null,null,null,null,null,null,null,null,null,null,null,null,null,null,null,null,null,null,null,null,null,null,null,null,null,null,null,null,null,null,null,null,null,null,null,null,null,null,null,null,null,null,null,null,null,null,null,null,null,null,null,null,null,null,null,null,null,null,null,null,null,null,null,null,null,null,null,null,null,null,null,null,null,null,"LAYER 9",null,"---",null,null,"---",null,null,"kg C2H4-eq",{"$error":"#N/A"},{"$error":"#N/A"},null,null,null,null,null,null,null,"---",null,null,"---"]
[null,null,null,null,null,null,null,null,null,null,null,null,null,null,null,null,null,null,null,null,null,null,null,null,null,null,null,null,null,null,null,null,null,null,null,null,null,null,null,null,null,null,null,null,null,null,null,null,null,null,null,null,null,null,"Miranda do Douro",2,null,null,null,null,null,null,null,null,null,null,null,null,null,null,null,null,null,null,null,null,null,null,null,null,null,null,null,null,null,null,null,null,"Fafe",null,null,null,null,null,null,null,null,null,null,null,null,null,null,null,null,null,null,null,null,null,null,null,null,null,null,null,null,null,null,null,null,null,null,null,null,null,null,null,null,null,null,null,null,null,null,null,null,null,null,null,null,null,null,null,null,null,null,null,null,null,null,null,null,null,null,null,null,null,null,null,null,null,null,null,null,null,null,null,null,null,null,null,null,null,null,null,null,null,null,null,null,null,null,null,null,null,null,null,null,null,null,null,null,null,null,null,null,null,null,null,"LAYER 10",null,"---",null,null,"---",null,null,"kg C2H4-eq",{"$error":"#N/A"},{"$error":"#N/A"},null,null,null,null,null,null,null,"---",null,null,"---"]
[null,null,null,null,null,null,null,null,null,null,null,null,null,null,null,null,null,null,null,null,null,null,null,null,null,null,null,null,null,null,null,null,null,null,null,null,null,null,null,null,null,null,null,null,null,null,null,null,null,null,null,null,null,null,"Mirandela",2,null,null,null,null,null,null,null,null,null,null,null,null,null,null,null,null,null,null,null,null,null,null,null,null,null,null,null,null,null,null,null,null,"Faro",null,null,null,null,null,null,null,null,null,null,null,null,null,null,null,null,null,null,null,null,null,null,null,null,null,null,null,null,null,null,null,null,null,null,null,null,null,null,null,null,null,null,null,null,null,null,null,null,null,null,null,null,null,null,null,null,null,null,null,null,null,null,null,null,null,null,null,null,null,null,null,null,null,null,null,null,null,null,null,null,null,null,null,null,null,null,null,null,null,null,null,null,null,null,null,null,null,null,null,null,null,null,null,null,null,null,null,null,null,null,null,null,null,"Material 2",null,null,"Indicator",null,null,null,null,null,null,null,null,null,null,null,null,{"$f":"GU162","v":"---"},null,null,{"$f":"GX162","v":"---"}]
[null,null,null,null,null,null,null,null,null,null,null,null,null,null,null,null,null,null,null,null,null,null,null,null,null,null,null,null,null,null,null,null,null,null,null,null,null,null,null,null,null,null,null,null,null,null,null,null,null,null,null,null,null,null,"Mogadouro",2,null,null,null,null,null,null,null,null,null,null,null,null,null,null,null,null,null,null,null,null,null,null,null,null,null,null,null,null,null,null,null,null,"Felgueiras",null,null,null,null,null,null,null,null,null,null,null,null,null,null,null,null,null,null,null,null,null,null,null,null,null,null,null,null,null,null,null,null,null,null,null,null,null,null,null,null,null,null,null,null,null,null,null,null,null,null,null,null,null,null,null,null,null,null,null,null,null,null,null,null,null,null,null,null,null,null,null,null,null,null,null,null,null,null,null,null,null,null,null,null,null,null,null,null,null,null,null,null,null,null,null,null,null,null,null,null,null,null,null,null,null,null,null,null,null,null,null,"LAYER 1",null,{"$f":"GU105","v":"---"},null,null,{"$f":"IF($HE$152=1,HD50,IF($HE$152=2,HJ50,IF($HE$152=3,HP50,IF($HE$152=4,HV50,IF($HE$152=5,IB50,IF($HE$152=6,IH50,IF($HE$152=7,IN50,0)))))))","v":"---"},null,null,{"$f":"IF($HE$152=1,$SV$316,IF($HE$152=2,$SV$317,IF($HE$152=3,$SV$318,IF($HE$152=4,$SV$319,IF($HE$152=5,$SV$320,IF($HE$152=6,$SV$321,IF($HE$152=7,$SV$322,0)))))))","v":"kg C2H4-eq"},{"$f":"VLOOKUP(HB161,$ST$316:$SV$322,2)","v":{"$error":"#N/A"}},{"$f":"VLOOKUP(HC161,$ST$316:$SV$322,2)","v":{"$error":"#N/A"}},null,null,null,null,null,null,null,"---",null,null,"---"]
[null,null,null,null,null,null,null,null,null,null,null,null,null,null,null,null,null,null,null,null,null,null,null,null,null,null,null,null,null,null,null,null,null,null,null,null,null,null,null,null,null,null,null,null,null,null,null,null,null,null,null,null,null,null,"Moimenta da Beira",7,null,null,null,null,null,null,null,null,null,null,null,null,null,null,null,null,null,null,null,null,null,null,null,null,null,null,null,null,null,null,null,null,"Ferreira do Alentejo",null,null,null,null,null,null,null,null,null,null,null,null,null,null,null,null,null,null,null,null,null,null,null,null,null,null,null,null,null,null,null,null,null,null,null,null,null,null,null,null,null,null,null,null,null,null,null,null,null,null,null,null,null,null,null,null,null,null,null,null,null,null,null,null,null,null,null,null,null,null,null,null,null,null,null,null,null,null,null,null,null,null,null,null,null,null,null,null,null,null,null,null,null,null,null,null,null,null,null,null,null,null,null,null,null,null,null,null,null,null,null,"LAYER 2",null,"---",null,null,"---",null,null,"kg C2H4-eq",{"$error":"#N/A"},{"$error":"#N/A"},null,null,null,null,null,null,null,"TB Strip XPS (10 mm) [IFoam]",null,null,1.8529411764705883E-4]
[null,null,null,null,null,null,null,null,null,null,null,null,null,null,null,null,null,null,null,null,null,null,null,null,null,null,null,null,null,null,null,null,null,null,null,null,null,null,null,null,null,null,null,null,null,null,null,null,null,null,null,null,null,null,"Moita",23,null,null,null,null,null,null,null,null,null,null,null,null,null,null,null,null,null,null,null,null,null,null,null,null,null,null,null,null,null,null,null,null,"Ferreira do Zêzere",null,null,null,null,null,null,null,null,null,null,null,null,null,null,null,null,null,null,null,null,null,null,null,null,null,null,null,null,null,null,null,null,null,null,null,null,null,null,null,null,null,null,null,null,null,null,null,null,null,null,null,null,null,null,null,null,null,null,null,null,null,null,null,null,null,null,null,null,null,null,null,null,null,null,null,null,null,null,null,null,null,null,null,null,null,null,null,null,null,null,null,null,null,null,null,null,null,null,null,null,null,null,null,null,null,null,null,null,null,null,null,"LAYER 3",null,"TB Strip XPS (10 mm) [IFoam]",null,null,1.8529411764705883E-4,null,null,"kg C2H4-eq",{"$error":"#N/A"},{"$error":"#N/A"},null,null,null,null,null,null,null,"Steel C90/U93 (90 mm) [Pertecno]",null,null,4.6603460000000003E-4,null,null,null,null,null,null,null,null,null,null,null,null,null,null,null,null,null,null,null,null,null,null,null,null,"INPUT LIST"]
[null,null,null,null,null,null,null,null,null,null,null,null,null,null,null,null,null,null,null,null,null,null,null,null,null,null,null,null,null,null,null,null,null,null,null,null,null,null,null,null,null,null,null,null,null,null,null,null,null,null,null,null,null,null,"Monção",1,null,null,null,null,null,null,null,null,null,null,null,null,null,null,null,null,null,null,null,null,null,null,null,null,null,null,null,null,null,null,null,null,"Figueira da Foz",null,null,null,null,null,null,null,null,null,null,null,null,null,null,null,null,null,null,null,null,null,null,null,null,null,null,null,null,null,null,null,null,null,null,null,null,null,null,null,null,null,null,null,null,null,null,null,null,null,null,null,null,null,null,null,null,null,null,null,null,null,null,null,null,null,null,null,null,null,null,null,null,null,null,null,null,null,null,null,null,null,null,null,null,null,null,null,null,null,null,null,null,null,null,null,null,null,null,null,null,null,null,null,null,null,null,null,null,null,null,null,"LAYER 4",null,"Steel C90/U93 (90 mm) [Pertecno]",null,null,4.6603460000000003E-4,null,null,"kg C2H4-eq",{"$error":"#N/A"},{"$error":"#N/A"},null,null,null,null,null,null,null,"TB Strip XPS (10 mm) [IFoam]",null,null,1.8529411764705883E-4]
[null,null,null,null,null,null,null,null,null,null,null,null,null,null,null,null,null,null,null,null,null,null,null,null,null,null,null,null,null,null,null,null,null,null,null,null,null,null,null,null,null,null,null,null,null,null,null,null,null,null,null,null,null,null,"Monchique",28,null,null,null,null,null,null,null,null,null,null,null,null,null,null,null,null,null,null,null,null,null,null,null,null,null,null,null,null,null,null,null,null,"Figueira de Castelo Rodrigo",null,null,null,null,null,null,null,null,null,null,null,null,null,null,null,null,null,null,null,null,null,null,null,null,null,null,null,null,null,null,null,null,null,null,null,null,null,null,null,null,null,null,null,null,null,null,null,null,null,null,null,null,null,null,null,null,null,null,null,null,null,null,null,null,null,null,null,null,null,null,null,null,null,null,null,null,null,null,null,null,null,null,null,null,null,null,null,null,null,null,null,null,null,null,null,null,null,null,null,null,null,null,null,null,null,null,null,null,null,null,null,"LAYER 5",null,"TB Strip XPS (10 mm) [IFoam]",null,null,1.8529411764705883E-4,null,null,"kg C2H4-eq",{"$error":"#N/A"},{"$error":"#N/A"},null,null,null,null,null,null,null,"---",null,null,"---",null,null,null,null,null,null,null,null,null,null,null,null,null,null,null,null,null,null,null,null,null,null,null,null,"Abiotic Resources Depletion Potential - Elements (ADPE)",1]
[null,null,null,null,null,null,null,null,null,null,null,null,null,null,null,null,null,null,null,null,null,null,null,null,null,null,null,null,null,null,null,null,null,null,null,null,null,null,null,null,null,null,null,null,null,null,null,null,null,null,null,null,null,null,"Mondim de Basto",4,null,null,null,null,null,null,null,null,null,null,null,null,null,null,null,null,null,null,null,null,null,null,null,null,null,null,null,null,null,null,null,null,"Figueiró dos Vinhos",null,null,null,null,null,null,null,null,null,null,null,null,null,null,null,null,null,null,null,null,null,null,null,null,null,null,null,null,null,null,null,null,null,null,null,null,null,null,null,null,null,null,null,null,null,null,null,null,null,null,null,null,null,null,null,null,null,null,null,null,null,null,null,null,null,null,null,null,null,null,null,null,null,null,null,null,null,null,null,null,null,null,null,null,null,null,null,null,null,null,null,null,null,null,null,null,null,null,null,null,null,null,null,null,null,null,null,null,null,null,null,"LAYER 6",null,"---",null,null,"---",null,null,"kg C2H4-eq",{"$error":"#N/A"},{"$error":"#N/A"},null,null,null,null,null,null,null,"---",null,null,"---",null,null,null,null,null,null,null,null,null,null,null,null,null,null,null,null,null,null,null,null,null,null,null,null,"Abiotic Resources Depletion Potential - Fossil Resources (ADPF)",2]
[null,null,null,null,null,null,null,null,null,null,null,null,null,null,null,null,null,null,null,null,null,null,null,null,null,null,null,null,null,null,null,null,null,null,null,null,null,null,null,null,null,null,null,null,null,null,null,null,null,null,null,null,null,null,"Monforte",24,null,null,null,null,null,null,null,null,null,null,null,null,null,null,null,null,null,null,null,null,null,null,null,null,null,null,null,null,null,null,null,null,"Fornos de Algodres",null,null,null,null,null,null,null,null,null,null,null,null,null,null,null,null,null,null,null,null,null,null,null,null,null,null,null,null,null,null,null,null,null,null,null,null,null,null,null,null,null,null,null,null,null,null,null,null,null,null,null,null,null,null,null,null,null,null,null,null,null,null,null,null,null,null,null,null,null,null,null,null,null,null,null,null,null,null,null,null,null,null,null,null,null,null,null,null,null,null,null,null,null,null,null,null,null,null,null,null,null,null,null,null,null,null,null,null,null,null,null,"LAYER 7",null,"---",null,null,"---",null,null,"kg C2H4-eq",{"$error":"#N/A"},{"$error":"#N/A"},null,null,null,null,null,null,null,"---",null,null,"---",null,null,null,null,null,null,null,null,null,null,null,null,null,null,null,null,null,null,null,null,null,null,null,null,"Acidification Potential (AP)",3]
[null,null,null,null,null,null,null,null,null,null,null,null,null,null,null,null,null,null,null,null,null,null,null,null,null,null,null,null,null,null,null,null,null,null,null,null,null,null,null,null,null,null,null,null,null,null,null,null,null,null,null,null,null,null,"Montalegre",2,null,null,null,null,null,null,null,null,null,null,null,null,null,null,null,null,null,null,null,null,null,null,null,null,null,null,null,null,null,null,null,null,"Freixo de Espada à Cinta",null,null,null,null,null,null,null,null,null,null,null,null,null,null,null,null,null,null,null,null,null,null,null,null,null,null,null,null,null,null,null,null,null,null,null,null,null,null,null,null,null,null,null,null,null,null,null,null,null,null,null,null,null,null,null,null,null,null,null,null,null,null,null,null,null,null,null,null,null,null,null,null,null,null,null,null,null,null,null,null,null,null,null,null,null,null,null,null,null,null,null,null,null,null,null,null,null,null,null,null,null,null,null,null,null,null,null,null,null,null,null,"LAYER 8",null,"---",null,null,"---",null,null,"kg C2H4-eq",{"$error":"#N/A"},{"$error":"#N/A"},null,null,null,null,null,null,null,"---",null,null,"---",null,null,null,null,null,null,null,null,null,null,null,null,null,null,null,null,null,null,null,null,null,null,null,null,"Eutrophication Potential (EP)",4]
[null,null,null,null,null,null,null,null,null,null,null,null,null,null,null,null,null,null,null,null,null,null,null,null,null,null,null,null,null,null,null,null,null,null,null,null,null,null,null,null,null,null,null,null,null,null,null,null,null,null,null,null,null,null,"Montemor-o-Novo",25,null,null,null,null,null,null,null,null,null,null,null,null,null,null,null,null,null,null,null,null,null,null,null,null,null,null,null,null,null,null,null,null,"Fronteira",null,null,null,null,null,null,null,null,null,null,null,null,null,null,null,null,null,null,null,null,null,null,null,null,null,null,null,null,null,null,null,null,null,null,null,null,null,null,null,null,null,null,null,null,null,null,null,null,null,null,null,null,null,null,null,null,null,null,null,null,null,null,null,null,null,null,null,null,null,null,null,null,null,null,null,null,null,null,null,null,null,null,null,null,null,null,null,null,null,null,null,null,null,null,null,null,null,null,null,null,null,null,null,null,null,null,null,null,null,null,null,"LAYER 9",null,"---",null,null,"---",null,null,"kg C2H4-eq",{"$error":"#N/A"},{"$error":"#N/A"},null,null,null,null,null,null,null,"---",null,null,"---",null,null,null,null,null,null,null,null,null,null,null,null,null,null,null,null,null,null,null,null,null,null,null,null,"Global Warming Potential (GWP)",6]
[null,null,null,null,null,null,null,null,null,null,null,null,null,null,null,null,null,null,null,null,null,null,null,null,null,null,null,null,null,null,null,null,null,null,null,null,null,null,null,null,null,null,null,null,null,null,null,null,null,null,null,null,null,null,"Montemor-o-Velho",10,null,null,null,null,null,null,null,null,null,null,null,null,null,null,null,null,null,null,null,null,null,null,null,null,null,null,null,null,null,null,null,null,"Funchal",null,null,null,null,null,null,null,null,null,null,null,null,null,null,null,null,null,null,null,null,null,null,null,null,null,null,null,null,null,null,null,null,null,null,null,null,null,null,null,null,null,null,null,null,null,null,null,null,null,null,null,null,null,null,null,null,null,null,null,null,null,null,null,null,null,null,null,null,null,null,null,null,null,null,null,null,null,null,null,null,null,null,null,null,null,null,null,null,null,null,null,null,null,null,null,null,null,null,null,null,null,null,null,null,null,null,null,null,null,null,null,"LAYER 10",null,"---",null,null,"---",null,null,"kg C2H4-eq",{"$error":"#N/A"},{"$error":"#N/A"},null,null,null,null,null,null,null,null,null,null,null,null,null,null,null,null,null,null,null,null,null,null,null,null,null,null,null,null,null,null,null,null,null,null,null,"Photochemical Ozone Creation Potential (POCP)",5]
[null,null,null,null,null,null,null,null,null,null,null,null,null,null,null,null,null,null,null,null,null,null,null,null,null,null,null,null,null,null,null,null,null,null,null,null,null,null,null,null,null,null,null,null,null,null,null,null,null,null,null,null,null,null,"Montijo",23,null,null,null,null,null,null,null,null,null,null,null,null,null,null,null,null,null,null,null,null,null,null,null,null,null,null,null,null,null,null,null,null,"Fundão",null,null,null,null,null,null,null,null,null,null,null,null,null,null,null,null,null,null,null,null,null,null,null,null,null,null,null,null,null,null,null,null,null,null,null,null,null,null,null,null,null,null,null,null,null,null,null,null,null,null,null,null,null,null,null,null,null,null,null,null,null,null,null,null,null,null,null,null,null,null,null,null,null,null,null,null,null,null,null,null,null,null,null,null,null,null,null,null,null,null,null,null,null,null,null,null,null,null,null,null,null,null,null,null,null,null,null,null,null,null,null,null,null,"TOTAL",null,null,{"$f":"SUM(GX151:GZ160)+SUM(GX162:GZ171)","v":1.5195822835294118E-2},null,null,null,null,null,null,null,null,null,null,null,null,null,null,null,null,null,null,null,null,null,null,null,null,null,null,null,null,null,null,null,null,null,null,null,null,null,null,null,null,"Stratospheric Ozone Layer Depletion Potential (ODP)",7]
[null,null,null,null,null,null,null,null,null,null,null,null,null,null,null,null,null,null,null,null,null,null,null,null,null,null,null,null,null,null,null,null,null,null,null,null,null,null,null,null,null,null,null,null,null,null,null,null,null,null,null,null,null,null,"Mora",24,null,null,null,null,null,null,null,null,null,null,null,null,null,null,null,null,null,null,null,null,null,null,null,null,null,null,null,null,null,null,null,null,"Gavião"]
[null,null,null,null,null,null,null,null,null,null,null,null,null,null,null,null,null,null,null,null,null,null,null,null,null,null,null,null,null,null,null,null,null,null,null,null,null,null,null,null,null,null,null,null,null,null,null,null,null,null,null,null,null,null,"Mortágua",10,null,null,null,null,null,null,null,null,null,null,null,null,null,null,null,null,null,null,null,null,null,null,null,null,null,null,null,null,null,null,null,null,"Góis"]
[null,null,null,null,null,null,null,null,null,null,null,null,null,null,null,null,null,null,null,null,null,null,null,null,null,null,null,null,null,null,null,null,null,null,null,null,null,null,null,null,null,null,null,null,null,null,null,null,null,null,null,null,null,null,"Moura",27,null,null,null,null,null,null,null,null,null,null,null,null,null,null,null,null,null,null,null,null,null,null,null,null,null,null,null,null,null,null,null,null,"Golegã"]
[null,null,null,null,null,null,null,null,null,null,null,null,null,null,null,null,null,null,null,null,null,null,null,null,null,null,null,null,null,null,null,null,null,null,null,null,null,null,null,null,null,null,null,null,null,null,null,null,null,null,null,null,null,null,"Mourão",25,null,null,null,null,null,null,null,null,null,null,null,null,null,null,null,null,null,null,null,null,null,null,null,null,null,null,null,null,null,null,null,null,"Gondomar",null,null,null,null,null,null,null,null,null,null,null,null,null,null,null,null,null,null,null,null,null,null,null,null,null,null,null,null,null,null,null,null,null,null,null,null,null,null,null,null,null,null,null,null,null,null,null,null,null,null,null,null,null,null,null,null,null,null,null,null,null,null,null,null,null,null,null,null,null,null,null,null,null,null,null,null,null,null,null,null,null,null,null,null,null,null,null,null,null,null,null,null,null,null,null,null,null,null,null,null,null,null,null,null,null,null,null,null,null,null,null,"GRAPH"]
[null,null,null,null,null,null,null,null,null,null,null,null,null,null,null,null,null,null,null,null,null,null,null,null,null,null,null,null,null,null,null,null,null,null,null,null,null,null,null,null,null,null,null,null,null,null,null,null,null,null,null,null,null,null,"Murça",7,null,null,null,null,null,null,null,null,null,null,null,null,null,null,null,null,null,null,null,null,null,null,null,null,null,null,null,null,null,null,null,null,"Gouveia"]
[null,null,null,null,null,null,null,null,null,null,null,null,null,null,null,null,null,null,null,null,null,null,null,null,null,null,null,null,null,null,null,null,null,null,null,null,null,null,null,null,null,null,null,null,null,null,null,null,null,null,null,null,null,null,"Murtosa",9,null,null,null,null,null,null,null,null,null,null,null,null,null,null,null,null,null,null,null,null,null,null,null,null,null,null,null,null,null,null,null,null,"Grândola",null,null,null,null,null,null,null,null,null,null,null,null,null,null,null,null,null,null,null,null,null,null,null,null,null,null,null,null,null,null,null,null,null,null,null,null,null,null,null,null,null,null,null,null,null,null,null,null,null,null,null,null,null,null,null,null,null,null,null,null,null,null,null,null,null,null,null,null,null,null,null,null,null,null,null,null,null,null,null,null,null,null,null,null,null,null,null,null,null,null,null,null,null,null,null,null,null,null,null,null,null,null,null,null,null,null,null,null,null,null,null,"A - TOTAL",null,{"$f":"HU151","v":6.2640000000000005E-3}]
[null,null,null,null,null,null,null,null,null,null,null,null,null,null,null,null,null,null,null,null,null,null,null,null,null,null,null,null,null,null,null,null,null,null,null,null,null,null,null,null,null,null,null,null,null,null,null,null,null,null,null,null,null,null,"Nazaré",19,null,null,null,null,null,null,null,null,null,null,null,null,null,null,null,null,null,null,null,null,null,null,null,null,null,null,null,null,null,null,null,null,"Guarda",null,null,null,null,null,null,null,null,null,null,null,null,null,null,null,null,null,null,null,null,null,null,null,null,null,null,null,null,null,null,null,null,null,null,null,null,null,null,null,null,null,null,null,null,null,null,null,null,null,null,null,null,null,null,null,null,null,null,null,null,null,null,null,null,null,null,null,null,null,null,null,null,null,null,null,null,null,null,null,null,null,null,null,null,null,null,null,null,null,null,null,null,null,null,null,null,null,null,null,null,null,null,null,null,null,null,null,null,null,null,null,"A - COMPONENT",null,{"$f":"GX172","v":1.5195822835294118E-2}]
[null,null,null,null,null,null,null,null,null,null,null,null,null,null,null,null,null,null,null,null,null,null,null,null,null,null,null,null,null,null,null,null,null,null,null,null,null,null,null,null,null,null,null,null,null,null,null,null,null,null,null,null,null,null,"Nelas",15,null,null,null,null,null,null,null,null,null,null,null,null,null,null,null,null,null,null,null,null,null,null,null,null,null,null,null,null,null,null,null,null,"Guimarães",null,null,null,null,null,null,null,null,null,null,null,null,null,null,null,null,null,null,null,null,null,null,null,null,null,null,null,null,null,null,null,null,null,null,null,null,null,null,null,null,null,null,null,null,null,null,null,null,null,null,null,null,null,null,null,null,null,null,null,null,null,null,null,null,null,null,null,null,null,null,null,null,null,null,null,null,null,null,null,null,null,null,null,null,null,null,null,null,null,null,null,null,null,null,null,null,null,null,null,null,null,null,null,null,null,null,null,null,null,null,null,"B - TOTAL",null,{"$f":"HU123","v":6.2640000000000005E-3}]
[null,null,null,null,null,null,null,null,null,null,null,null,null,null,null,null,null,null,null,null,null,null,null,null,null,null,null,null,null,null,null,null,null,null,null,null,null,null,null,null,null,null,null,null,null,null,null,null,null,null,null,null,null,null,"Nisa",24,null,null,null,null,null,null,null,null,null,null,null,null,null,null,null,null,null,null,null,null,null,null,null,null,null,null,null,null,null,null,null,null,"Horta",null,null,null,null,null,null,null,null,null,null,null,null,null,null,null,null,null,null,null,null,null,null,null,null,null,null,null,null,null,null,null,null,null,null,null,null,null,null,null,null,null,null,null,null,null,null,null,null,null,null,null,null,null,null,null,null,null,null,null,null,null,null,null,null,null,null,null,null,null,null,null,null,null,null,null,null,null,null,null,null,null,null,null,null,null,null,null,null,null,null,null,null,null,null,null,null,null,null,null,null,null,null,null,null,null,null,null,null,null,null,null,"B - COMPONENT",null,{"$f":"GX144","v":1.4825234600000001E-2}]
[null,null,null,null,null,null,null,null,null,null,null,null,null,null,null,null,null,null,null,null,null,null,null,null,null,null,null,null,null,null,null,null,null,null,null,null,null,null,null,null,null,null,null,null,null,null,null,null,null,null,null,null,null,null,"Nordeste",29,null,null,null,null,null,null,null,null,null,null,null,null,null,null,null,null,null,null,null,null,null,null,null,null,null,null,null,null,null,null,null,null,"Idanha-a-Nova"]
[null,null,null,null,null,null,null,null,null,null,null,null,null,null,null,null,null,null,null,null,null,null,null,null,null,null,null,null,null,null,null,null,null,null,null,null,null,null,null,null,null,null,null,null,null,null,null,null,null,null,null,null,null,null,"Óbidos",19,null,null,null,null,null,null,null,null,null,null,null,null,null,null,null,null,null,null,null,null,null,null,null,null,null,null,null,null,null,null,null,null,"Ílhavo"]
[null,null,null,null,null,null,null,null,null,null,null,null,null,null,null,null,null,null,null,null,null,null,null,null,null,null,null,null,null,null,null,null,null,null,null,null,null,null,null,null,null,null,null,null,null,null,null,null,null,null,null,null,null,null,"Odemira",26,null,null,null,null,null,null,null,null,null,null,null,null,null,null,null,null,null,null,null,null,null,null,null,null,null,null,null,null,null,null,null,null,"Lagoa - Algarve"]
[null,null,null,null,null,null,null,null,null,null,null,null,null,null,null,null,null,null,null,null,null,null,null,null,null,null,null,null,null,null,null,null,null,null,null,null,null,null,null,null,null,null,null,null,null,null,null,null,null,null,null,null,null,null,"Odivelas",22,null,null,null,null,null,null,null,null,null,null,null,null,null,null,null,null,null,null,null,null,null,null,null,null,null,null,null,null,null,null,null,null,"Lagoa - Açores"]
[null,null,null,null,null,null,null,null,null,null,null,null,null,null,null,null,null,null,null,null,null,null,null,null,null,null,null,null,null,null,null,null,null,null,null,null,null,null,null,null,null,null,null,null,null,null,null,null,null,null,null,null,null,null,"Oeiras",22,null,null,null,null,null,null,null,null,null,null,null,null,null,null,null,null,null,null,null,null,null,null,null,null,null,null,null,null,null,null,null,null,"Lagos"]
[null,null,null,null,null,null,null,null,null,null,null,null,null,null,null,null,null,null,null,null,null,null,null,null,null,null,null,null,null,null,null,null,null,null,null,null,null,null,null,null,null,null,null,null,null,null,null,null,null,null,null,null,null,null,"Oleiros",17,null,null,null,null,null,null,null,null,null,null,null,null,null,null,null,null,null,null,null,null,null,null,null,null,null,null,null,null,null,null,null,null,"Lajes das Flores"]
[null,null,null,null,null,null,null,null,null,null,null,null,null,null,null,null,null,null,null,null,null,null,null,null,null,null,null,null,null,null,null,null,null,null,null,null,null,null,null,null,null,null,null,null,null,null,null,null,null,null,null,null,null,null,"Olhão",28,null,null,null,null,null,null,null,null,null,null,null,null,null,null,null,null,null,null,null,null,null,null,null,null,null,null,null,null,null,null,null,null,"Lajes do Pico"]
[null,null,null,null,null,null,null,null,null,null,null,null,null,null,null,null,null,null,null,null,null,null,null,null,null,null,null,null,null,null,null,null,null,null,null,null,null,null,null,null,null,null,null,null,null,null,null,null,null,null,null,null,null,null,"Oliveira de Azeméis",8,null,null,null,null,null,null,null,null,null,null,null,null,null,null,null,null,null,null,null,null,null,null,null,null,null,null,null,null,null,null,null,null,"Lamego"]
[null,null,null,null,null,null,null,null,null,null,null,null,null,null,null,null,null,null,null,null,null,null,null,null,null,null,null,null,null,null,null,null,null,null,null,null,null,null,null,null,null,null,null,null,null,null,null,null,null,null,null,null,null,null,"Oliveira de Frades",15,null,null,null,null,null,null,null,null,null,null,null,null,null,null,null,null,null,null,null,null,null,null,null,null,null,null,null,null,null,null,null,null,"Leiria"]
[null,null,null,null,null,null,null,null,null,null,null,null,null,null,null,null,null,null,null,null,null,null,null,null,null,null,null,null,null,null,null,null,null,null,null,null,null,null,null,null,null,null,null,null,null,null,null,null,null,null,null,null,null,null,"Oliveira do Bairro",9,null,null,null,null,null,null,null,null,null,null,null,null,null,null,null,null,null,null,null,null,null,null,null,null,null,null,null,null,null,null,null,null,"Lisboa"]
[null,null,null,null,null,null,null,null,null,null,null,null,null,null,null,null,null,null,null,null,null,null,null,null,null,null,null,null,null,null,null,null,null,null,null,null,null,null,null,null,null,null,null,null,null,null,null,null,null,null,null,null,null,null,"Oliveira do Hospital",16,null,null,null,null,null,null,null,null,null,null,null,null,null,null,null,null,null,null,null,null,null,null,null,null,null,null,null,null,null,null,null,null,"Loulé"]
[null,null,null,null,null,null,null,null,null,null,null,null,null,null,null,null,null,null,null,null,null,null,null,null,null,null,null,null,null,null,null,null,null,null,null,null,null,null,null,null,null,null,null,null,null,null,null,null,null,null,null,null,null,null,"Ourém",20,null,null,null,null,null,null,null,null,null,null,null,null,null,null,null,null,null,null,null,null,null,null,null,null,null,null,null,null,null,null,null,null,"Loures"]
[null,null,null,null,null,null,null,null,null,null,null,null,null,null,null,null,null,null,null,null,null,null,null,null,null,null,null,null,null,null,null,null,null,null,null,null,null,null,null,null,null,null,null,null,null,null,null,null,null,null,null,null,null,null,"Ourique",27,null,null,null,null,null,null,null,null,null,null,null,null,null,null,null,null,null,null,null,null,null,null,null,null,null,null,null,null,null,null,null,null,"Lourinhã"]
[null,null,null,null,null,null,null,null,null,null,null,null,null,null,null,null,null,null,null,null,null,null,null,null,null,null,null,null,null,null,null,null,null,null,null,null,null,null,null,null,null,null,null,null,null,null,null,null,null,null,null,null,null,null,"Ovar",9,null,null,null,null,null,null,null,null,null,null,null,null,null,null,null,null,null,null,null,null,null,null,null,null,null,null,null,null,null,null,null,null,"Lousã"]
[null,null,null,null,null,null,null,null,null,null,null,null,null,null,null,null,null,null,null,null,null,null,null,null,null,null,null,null,null,null,null,null,null,null,null,null,null,null,null,null,null,null,null,null,null,null,null,null,null,null,null,null,null,null,"Paços de Ferreira",6,null,null,null,null,null,null,null,null,null,null,null,null,null,null,null,null,null,null,null,null,null,null,null,null,null,null,null,null,null,null,null,null,"Lousada"]
[null,null,null,null,null,null,null,null,null,null,null,null,null,null,null,null,null,null,null,null,null,null,null,null,null,null,null,null,null,null,null,null,null,null,null,null,null,null,null,null,null,null,null,null,null,null,null,null,null,null,null,null,null,null,"Palmela",23,null,null,null,null,null,null,null,null,null,null,null,null,null,null,null,null,null,null,null,null,null,null,null,null,null,null,null,null,null,null,null,null,"Mação"]
[null,null,null,null,null,null,null,null,null,null,null,null,null,null,null,null,null,null,null,null,null,null,null,null,null,null,null,null,null,null,null,null,null,null,null,null,null,null,null,null,null,null,null,null,null,null,null,null,null,null,null,null,null,null,"Pampilhosa da Serra",16,null,null,null,null,null,null,null,null,null,null,null,null,null,null,null,null,null,null,null,null,null,null,null,null,null,null,null,null,null,null,null,null,"Macedo de Cavaleiros"]
[null,null,null,null,null,null,null,null,null,null,null,null,null,null,null,null,null,null,null,null,null,null,null,null,null,null,null,null,null,null,null,null,null,null,null,null,null,null,null,null,null,null,null,null,null,null,null,null,null,null,null,null,null,null,"Paredes",6,null,null,null,null,null,null,null,null,null,null,null,null,null,null,null,null,null,null,null,null,null,null,null,null,null,null,null,null,null,null,null,null,"Machico"]
[null,null,null,null,null,null,null,null,null,null,null,null,null,null,null,null,null,null,null,null,null,null,null,null,null,null,null,null,null,null,null,null,null,null,null,null,null,null,null,null,null,null,null,null,null,null,null,null,null,null,null,null,null,null,"Paredes de Coura",1,null,null,null,null,null,null,null,null,null,null,null,null,null,null,null,null,null,null,null,null,null,null,null,null,null,null,null,null,null,null,null,null,"Madalena"]
[null,null,null,null,null,null,null,null,null,null,null,null,null,null,null,null,null,null,null,null,null,null,null,null,null,null,null,null,null,null,null,null,null,null,null,null,null,null,null,null,null,null,null,null,null,null,null,null,null,null,null,null,null,null,"Pedrógão Grande",16,null,null,null,null,null,null,null,null,null,null,null,null,null,null,null,null,null,null,null,null,null,null,null,null,null,null,null,null,null,null,null,null,"Mafra"]
[null,null,null,null,null,null,null,null,null,null,null,null,null,null,null,null,null,null,null,null,null,null,null,null,null,null,null,null,null,null,null,null,null,null,null,null,null,null,null,null,null,null,null,null,null,null,null,null,null,null,null,null,null,null,"Penacova",10,null,null,null,null,null,null,null,null,null,null,null,null,null,null,null,null,null,null,null,null,null,null,null,null,null,null,null,null,null,null,null,null,"Maia"]
[null,null,null,null,null,null,null,null,null,null,null,null,null,null,null,null,null,null,null,null,null,null,null,null,null,null,null,null,null,null,null,null,null,null,null,null,null,null,null,null,null,null,null,null,null,null,null,null,null,null,null,null,null,null,"Penafiel",6,null,null,null,null,null,null,null,null,null,null,null,null,null,null,null,null,null,null,null,null,null,null,null,null,null,null,null,null,null,null,null,null,"Mangualde"]
[null,null,null,null,null,null,null,null,null,null,null,null,null,null,null,null,null,null,null,null,null,null,null,null,null,null,null,null,null,null,null,null,null,null,null,null,null,null,null,null,null,null,null,null,null,null,null,null,null,null,null,null,null,null,"Penalva do Castelo",15,null,null,null,null,null,null,null,null,null,null,null,null,null,null,null,null,null,null,null,null,null,null,null,null,null,null,null,null,null,null,null,null,"Manteigas"]
[null,null,null,null,null,null,null,null,null,null,null,null,null,null,null,null,null,null,null,null,null,null,null,null,null,null,null,null,null,null,null,null,null,null,null,null,null,null,null,null,null,null,null,null,null,null,null,null,null,null,null,null,null,null,"Penamacor",12,null,null,null,null,null,null,null,null,null,null,null,null,null,null,null,null,null,null,null,null,null,null,null,null,null,null,null,null,null,null,null,null,"Marco de Canaveses"]
[null,null,null,null,null,null,null,null,null,null,null,null,null,null,null,null,null,null,null,null,null,null,null,null,null,null,null,null,null,null,null,null,null,null,null,null,null,null,null,null,null,null,null,null,null,null,null,null,null,null,null,null,null,null,"Penedono",7,null,null,null,null,null,null,null,null,null,null,null,null,null,null,null,null,null,null,null,null,null,null,null,null,null,null,null,null,null,null,null,null,"Marinha Grande"]
[null,null,null,null,null,null,null,null,null,null,null,null,null,null,null,null,null,null,null,null,null,null,null,null,null,null,null,null,null,null,null,null,null,null,null,null,null,null,null,null,null,null,null,null,null,null,null,null,null,null,null,null,null,null,"Penela",16,null,null,null,null,null,null,null,null,null,null,null,null,null,null,null,null,null,null,null,null,null,null,null,null,null,null,null,null,null,null,null,null,"Marvão"]
[null,null,null,null,null,null,null,null,null,null,null,null,null,null,null,null,null,null,null,null,null,null,null,null,null,null,null,null,null,null,null,null,null,null,null,null,null,null,null,null,null,null,null,null,null,null,null,null,null,null,null,null,null,null,"Peniche",19,null,null,null,null,null,null,null,null,null,null,null,null,null,null,null,null,null,null,null,null,null,null,null,null,null,null,null,null,null,null,null,null,"Matosinhos"]
[null,null,null,null,null,null,null,null,null,null,null,null,null,null,null,null,null,null,null,null,null,null,null,null,null,null,null,null,null,null,null,null,null,null,null,null,null,null,null,null,null,null,null,null,null,null,null,null,null,null,null,null,null,null,"Peso da Régua",7,null,null,null,null,null,null,null,null,null,null,null,null,null,null,null,null,null,null,null,null,null,null,null,null,null,null,null,null,null,null,null,null,"Mealhada"]
[null,null,null,null,null,null,null,null,null,null,null,null,null,null,null,null,null,null,null,null,null,null,null,null,null,null,null,null,null,null,null,null,null,null,null,null,null,null,null,null,null,null,null,null,null,null,null,null,null,null,null,null,null,null,"Pinhel",11,null,null,null,null,null,null,null,null,null,null,null,null,null,null,null,null,null,null,null,null,null,null,null,null,null,null,null,null,null,null,null,null,"Mêda"]
[null,null,null,null,null,null,null,null,null,null,null,null,null,null,null,null,null,null,null,null,null,null,null,null,null,null,null,null,null,null,null,null,null,null,null,null,null,null,null,null,null,null,null,null,null,null,null,null,null,null,null,null,null,null,"Pombal",18,null,null,null,null,null,null,null,null,null,null,null,null,null,null,null,null,null,null,null,null,null,null,null,null,null,null,null,null,null,null,null,null,"Melgaço"]
[null,null,null,null,null,null,null,null,null,null,null,null,null,null,null,null,null,null,null,null,null,null,null,null,null,null,null,null,null,null,null,null,null,null,null,null,null,null,null,null,null,null,null,null,null,null,null,null,null,null,null,null,null,null,"Ponta Delgada",29,null,null,null,null,null,null,null,null,null,null,null,null,null,null,null,null,null,null,null,null,null,null,null,null,null,null,null,null,null,null,null,null,"Mértola"]
[null,null,null,null,null,null,null,null,null,null,null,null,null,null,null,null,null,null,null,null,null,null,null,null,null,null,null,null,null,null,null,null,null,null,null,null,null,null,null,null,null,null,null,null,null,null,null,null,null,null,null,null,null,null,"Ponta do Sol",30,null,null,null,null,null,null,null,null,null,null,null,null,null,null,null,null,null,null,null,null,null,null,null,null,null,null,null,null,null,null,null,null,"Mesão Frio"]
[null,null,null,null,null,null,null,null,null,null,null,null,null,null,null,null,null,null,null,null,null,null,null,null,null,null,null,null,null,null,null,null,null,null,null,null,null,null,null,null,null,null,null,null,null,null,null,null,null,null,null,null,null,null,"Ponte da Barca",1,null,null,null,null,null,null,null,null,null,null,null,null,null,null,null,null,null,null,null,null,null,null,null,null,null,null,null,null,null,null,null,null,"Mira"]
[null,null,null,null,null,null,null,null,null,null,null,null,null,null,null,null,null,null,null,null,null,null,null,null,null,null,null,null,null,null,null,null,null,null,null,null,null,null,null,null,null,null,null,null,null,null,null,null,null,null,null,null,null,null,"Ponte de Lima",1,null,null,null,null,null,null,null,null,null,null,null,null,null,null,null,null,null,null,null,null,null,null,null,null,null,null,null,null,null,null,null,null,"Miranda do Corvo"]
[null,null,null,null,null,null,null,null,null,null,null,null,null,null,null,null,null,null,null,null,null,null,null,null,null,null,null,null,null,null,null,null,null,null,null,null,null,null,null,null,null,null,null,null,null,null,null,null,null,null,null,null,null,null,"Ponte de Sor",24,null,null,null,null,null,null,null,null,null,null,null,null,null,null,null,null,null,null,null,null,null,null,null,null,null,null,null,null,null,null,null,null,"Miranda do Douro"]
[null,null,null,null,null,null,null,null,null,null,null,null,null,null,null,null,null,null,null,null,null,null,null,null,null,null,null,null,null,null,null,null,null,null,null,null,null,null,null,null,null,null,null,null,null,null,null,null,null,null,null,null,null,null,"Portalegre",24,null,null,null,null,null,null,null,null,null,null,null,null,null,null,null,null,null,null,null,null,null,null,null,null,null,null,null,null,null,null,null,null,"Mirandela"]
[null,null,null,null,null,null,null,null,null,null,null,null,null,null,null,null,null,null,null,null,null,null,null,null,null,null,null,null,null,null,null,null,null,null,null,null,null,null,null,null,null,null,null,null,null,null,null,null,null,null,null,null,null,null,"Portel",25,null,null,null,null,null,null,null,null,null,null,null,null,null,null,null,null,null,null,null,null,null,null,null,null,null,null,null,null,null,null,null,null,"Mogadouro"]
[null,null,null,null,null,null,null,null,null,null,null,null,null,null,null,null,null,null,null,null,null,null,null,null,null,null,null,null,null,null,null,null,null,null,null,null,null,null,null,null,null,null,null,null,null,null,null,null,null,null,null,null,null,null,"Portimão",28,null,null,null,null,null,null,null,null,null,null,null,null,null,null,null,null,null,null,null,null,null,null,null,null,null,null,null,null,null,null,null,null,"Moimenta da Beira"]
[null,null,null,null,null,null,null,null,null,null,null,null,null,null,null,null,null,null,null,null,null,null,null,null,null,null,null,null,null,null,null,null,null,null,null,null,null,null,null,null,null,null,null,null,null,null,null,null,null,null,null,null,null,null,"Porto",5,null,null,null,null,null,null,null,null,null,null,null,null,null,null,null,null,null,null,null,null,null,null,null,null,null,null,null,null,null,null,null,null,"Moita"]
[null,null,null,null,null,null,null,null,null,null,null,null,null,null,null,null,null,null,null,null,null,null,null,null,null,null,null,null,null,null,null,null,null,null,null,null,null,null,null,null,null,null,null,null,null,null,null,null,null,null,null,null,null,null,"Porto de Mós",18,null,null,null,null,null,null,null,null,null,null,null,null,null,null,null,null,null,null,null,null,null,null,null,null,null,null,null,null,null,null,null,null,"Monção"]
[null,null,null,null,null,null,null,null,null,null,null,null,null,null,null,null,null,null,null,null,null,null,null,null,null,null,null,null,null,null,null,null,null,null,null,null,null,null,null,null,null,null,null,null,null,null,null,null,null,null,null,null,null,null,"Porto Moniz",30,null,null,null,null,null,null,null,null,null,null,null,null,null,null,null,null,null,null,null,null,null,null,null,null,null,null,null,null,null,null,null,null,"Monchique"]
[null,null,null,null,null,null,null,null,null,null,null,null,null,null,null,null,null,null,null,null,null,null,null,null,null,null,null,null,null,null,null,null,null,null,null,null,null,null,null,null,null,null,null,null,null,null,null,null,null,null,null,null,null,null,"Porto Santo",30,null,null,null,null,null,null,null,null,null,null,null,null,null,null,null,null,null,null,null,null,null,null,null,null,null,null,null,null,null,null,null,null,"Mondim de Basto"]
[null,null,null,null,null,null,null,null,null,null,null,null,null,null,null,null,null,null,null,null,null,null,null,null,null,null,null,null,null,null,null,null,null,null,null,null,null,null,null,null,null,null,null,null,null,null,null,null,null,null,null,null,null,null,"Póvoa de Lanhoso",4,null,null,null,null,null,null,null,null,null,null,null,null,null,null,null,null,null,null,null,null,null,null,null,null,null,null,null,null,null,null,null,null,"Monforte"]
[null,null,null,null,null,null,null,null,null,null,null,null,null,null,null,null,null,null,null,null,null,null,null,null,null,null,null,null,null,null,null,null,null,null,null,null,null,null,null,null,null,null,null,null,null,null,null,null,null,null,null,null,null,null,"Póvoa de Varzim",5,null,null,null,null,null,null,null,null,null,null,null,null,null,null,null,null,null,null,null,null,null,null,null,null,null,null,null,null,null,null,null,null,"Montalegre"]
[null,null,null,null,null,null,null,null,null,null,null,null,null,null,null,null,null,null,null,null,null,null,null,null,null,null,null,null,null,null,null,null,null,null,null,null,null,null,null,null,null,null,null,null,null,null,null,null,null,null,null,null,null,null,"Povoação",29,null,null,null,null,null,null,null,null,null,null,null,null,null,null,null,null,null,null,null,null,null,null,null,null,null,null,null,null,null,null,null,null,"Montemor-o-Novo"]
[null,null,null,null,null,null,null,null,null,null,null,null,null,null,null,null,null,null,null,null,null,null,null,null,null,null,null,null,null,null,null,null,null,null,null,null,null,null,null,null,null,null,null,null,null,null,null,null,null,null,null,null,null,null,"Praia da Vitória",29,null,null,null,null,null,null,null,null,null,null,null,null,null,null,null,null,null,null,null,null,null,null,null,null,null,null,null,null,null,null,null,null,"Montemor-o-Velho"]
[null,null,null,null,null,null,null,null,null,null,null,null,null,null,null,null,null,null,null,null,null,null,null,null,null,null,null,null,null,null,null,null,null,null,null,null,null,null,null,null,null,null,null,null,null,null,null,null,null,null,null,null,null,null,"Proença-a-Nova",17,null,null,null,null,null,null,null,null,null,null,null,null,null,null,null,null,null,null,null,null,null,null,null,null,null,null,null,null,null,null,null,null,"Montijo"]
[null,null,null,null,null,null,null,null,null,null,null,null,null,null,null,null,null,null,null,null,null,null,null,null,null,null,null,null,null,null,null,null,null,null,null,null,null,null,null,null,null,null,null,null,null,null,null,null,null,null,null,null,null,null,"Redondo",25,null,null,null,null,null,null,null,null,null,null,null,null,null,null,null,null,null,null,null,null,null,null,null,null,null,null,null,null,null,null,null,null,"Mora"]
[null,null,null,null,null,null,null,null,null,null,null,null,null,null,null,null,null,null,null,null,null,null,null,null,null,null,null,null,null,null,null,null,null,null,null,null,null,null,null,null,null,null,null,null,null,null,null,null,null,null,null,null,null,null,"Reguengos de Monsaraz",25,null,null,null,null,null,null,null,null,null,null,null,null,null,null,null,null,null,null,null,null,null,null,null,null,null,null,null,null,null,null,null,null,"Mortágua"]
[null,null,null,null,null,null,null,null,null,null,null,null,null,null,null,null,null,null,null,null,null,null,null,null,null,null,null,null,null,null,null,null,null,null,null,null,null,null,null,null,null,null,null,null,null,null,null,null,null,null,null,null,null,null,"Resende",6,null,null,null,null,null,null,null,null,null,null,null,null,null,null,null,null,null,null,null,null,null,null,null,null,null,null,null,null,null,null,null,null,"Moura"]
[null,null,null,null,null,null,null,null,null,null,null,null,null,null,null,null,null,null,null,null,null,null,null,null,null,null,null,null,null,null,null,null,null,null,null,null,null,null,null,null,null,null,null,null,null,null,null,null,null,null,null,null,null,null,"Ribeira Brava",30,null,null,null,null,null,null,null,null,null,null,null,null,null,null,null,null,null,null,null,null,null,null,null,null,null,null,null,null,null,null,null,null,"Mourão"]
[null,null,null,null,null,null,null,null,null,null,null,null,null,null,null,null,null,null,null,null,null,null,null,null,null,null,null,null,null,null,null,null,null,null,null,null,null,null,null,null,null,null,null,null,null,null,null,null,null,null,null,null,null,null,"Ribeira de Pena",2,null,null,null,null,null,null,null,null,null,null,null,null,null,null,null,null,null,null,null,null,null,null,null,null,null,null,null,null,null,null,null,null,"Murça"]
[null,null,null,null,null,null,null,null,null,null,null,null,null,null,null,null,null,null,null,null,null,null,null,null,null,null,null,null,null,null,null,null,null,null,null,null,null,null,null,null,null,null,null,null,null,null,null,null,null,null,null,null,null,null,"Ribeira Grande",29,null,null,null,null,null,null,null,null,null,null,null,null,null,null,null,null,null,null,null,null,null,null,null,null,null,null,null,null,null,null,null,null,"Murtosa"]
[null,null,null,null,null,null,null,null,null,null,null,null,null,null,null,null,null,null,null,null,null,null,null,null,null,null,null,null,null,null,null,null,null,null,null,null,null,null,null,null,null,null,null,null,null,null,null,null,null,null,null,null,null,null,"Rio Maior",21,null,null,null,null,null,null,null,null,null,null,null,null,null,null,null,null,null,null,null,null,null,null,null,null,null,null,null,null,null,null,null,null,"Nazaré"]
[null,null,null,null,null,null,null,null,null,null,null,null,null,null,null,null,null,null,null,null,null,null,null,null,null,null,null,null,null,null,null,null,null,null,null,null,null,null,null,null,null,null,null,null,null,null,null,null,null,null,null,null,null,null,"Sabrosa",7,null,null,null,null,null,null,null,null,null,null,null,null,null,null,null,null,null,null,null,null,null,null,null,null,null,null,null,null,null,null,null,null,"Nelas"]
[null,null,null,null,null,null,null,null,null,null,null,null,null,null,null,null,null,null,null,null,null,null,null,null,null,null,null,null,null,null,null,null,null,null,null,null,null,null,null,null,null,null,null,null,null,null,null,null,null,null,null,null,null,null,"Sabugal",11,null,null,null,null,null,null,null,null,null,null,null,null,null,null,null,null,null,null,null,null,null,null,null,null,null,null,null,null,null,null,null,null,"Nisa"]
[null,null,null,null,null,null,null,null,null,null,null,null,null,null,null,null,null,null,null,null,null,null,null,null,null,null,null,null,null,null,null,null,null,null,null,null,null,null,null,null,null,null,null,null,null,null,null,null,null,null,null,null,null,null,"Salvaterra de Magos",21,null,null,null,null,null,null,null,null,null,null,null,null,null,null,null,null,null,null,null,null,null,null,null,null,null,null,null,null,null,null,null,null,"Nordeste"]
[null,null,null,null,null,null,null,null,null,null,null,null,null,null,null,null,null,null,null,null,null,null,null,null,null,null,null,null,null,null,null,null,null,null,null,null,null,null,null,null,null,null,null,null,null,null,null,null,null,null,null,null,null,null,"Santa Comba Dão",15,null,null,null,null,null,null,null,null,null,null,null,null,null,null,null,null,null,null,null,null,null,null,null,null,null,null,null,null,null,null,null,null,"Óbidos"]
[null,null,null,null,null,null,null,null,null,null,null,null,null,null,null,null,null,null,null,null,null,null,null,null,null,null,null,null,null,null,null,null,null,null,null,null,null,null,null,null,null,null,null,null,null,null,null,null,null,null,null,null,null,null,"Santa Cruz",30,null,null,null,null,null,null,null,null,null,null,null,null,null,null,null,null,null,null,null,null,null,null,null,null,null,null,null,null,null,null,null,null,"Odemira"]
[null,null,null,null,null,null,null,null,null,null,null,null,null,null,null,null,null,null,null,null,null,null,null,null,null,null,null,null,null,null,null,null,null,null,null,null,null,null,null,null,null,null,null,null,null,null,null,null,null,null,null,null,null,null,"Santa Cruz da Graciosa",29,null,null,null,null,null,null,null,null,null,null,null,null,null,null,null,null,null,null,null,null,null,null,null,null,null,null,null,null,null,null,null,null,"Odivelas"]
[null,null,null,null,null,null,null,null,null,null,null,null,null,null,null,null,null,null,null,null,null,null,null,null,null,null,null,null,null,null,null,null,null,null,null,null,null,null,null,null,null,null,null,null,null,null,null,null,null,null,null,null,null,null,"Santa Cruz das Flores",29,null,null,null,null,null,null,null,null,null,null,null,null,null,null,null,null,null,null,null,null,null,null,null,null,null,null,null,null,null,null,null,null,"Oeiras"]
[null,null,null,null,null,null,null,null,null,null,null,null,null,null,null,null,null,null,null,null,null,null,null,null,null,null,null,null,null,null,null,null,null,null,null,null,null,null,null,null,null,null,null,null,null,null,null,null,null,null,null,null,null,null,"Santa Maria da Feira",8,null,null,null,null,null,null,null,null,null,null,null,null,null,null,null,null,null,null,null,null,null,null,null,null,null,null,null,null,null,null,null,null,"Oleiros"]
[null,null,null,null,null,null,null,null,null,null,null,null,null,null,null,null,null,null,null,null,null,null,null,null,null,null,null,null,null,null,null,null,null,null,null,null,null,null,null,null,null,null,null,null,null,null,null,null,null,null,null,null,null,null,"Santa Marta de Penaguião",7,null,null,null,null,null,null,null,null,null,null,null,null,null,null,null,null,null,null,null,null,null,null,null,null,null,null,null,null,null,null,null,null,"Olhão"]
[null,null,null,null,null,null,null,null,null,null,null,null,null,null,null,null,null,null,null,null,null,null,null,null,null,null,null,null,null,null,null,null,null,null,null,null,null,null,null,null,null,null,null,null,null,null,null,null,null,null,null,null,null,null,"Santana",30,null,null,null,null,null,null,null,null,null,null,null,null,null,null,null,null,null,null,null,null,null,null,null,null,null,null,null,null,null,null,null,null,"Oliveira de Azeméis"]
[null,null,null,null,null,null,null,null,null,null,null,null,null,null,null,null,null,null,null,null,null,null,null,null,null,null,null,null,null,null,null,null,null,null,null,null,null,null,null,null,null,null,null,null,null,null,null,null,null,null,null,null,null,null,"Santarém",21,null,null,null,null,null,null,null,null,null,null,null,null,null,null,null,null,null,null,null,null,null,null,null,null,null,null,null,null,null,null,null,null,"Oliveira de Frades"]
[null,null,null,null,null,null,null,null,null,null,null,null,null,null,null,null,null,null,null,null,null,null,null,null,null,null,null,null,null,null,null,null,null,null,null,null,null,null,null,null,null,null,null,null,null,null,null,null,null,null,null,null,null,null,"Santiago do Cacém",26,null,null,null,null,null,null,null,null,null,null,null,null,null,null,null,null,null,null,null,null,null,null,null,null,null,null,null,null,null,null,null,null,"Oliveira do Bairro"]
[null,null,null,null,null,null,null,null,null,null,null,null,null,null,null,null,null,null,null,null,null,null,null,null,null,null,null,null,null,null,null,null,null,null,null,null,null,null,null,null,null,null,null,null,null,null,null,null,null,null,null,null,null,null,"Santo Tirso",5,null,null,null,null,null,null,null,null,null,null,null,null,null,null,null,null,null,null,null,null,null,null,null,null,null,null,null,null,null,null,null,null,"Oliveira do Hospital"]
[null,null,null,null,null,null,null,null,null,null,null,null,null,null,null,null,null,null,null,null,null,null,null,null,null,null,null,null,null,null,null,null,null,null,null,null,null,null,null,null,null,null,null,null,null,null,null,null,null,null,null,null,null,null,"São Brás de Alportel",28,null,null,null,null,null,null,null,null,null,null,null,null,null,null,null,null,null,null,null,null,null,null,null,null,null,null,null,null,null,null,null,null,"Ourém"]
[null,null,null,null,null,null,null,null,null,null,null,null,null,null,null,null,null,null,null,null,null,null,null,null,null,null,null,null,null,null,null,null,null,null,null,null,null,null,null,null,null,null,null,null,null,null,null,null,null,null,null,null,null,null,"São João da Madeira",8,null,null,null,null,null,null,null,null,null,null,null,null,null,null,null,null,null,null,null,null,null,null,null,null,null,null,null,null,null,null,null,null,"Ourique"]
[null,null,null,null,null,null,null,null,null,null,null,null,null,null,null,null,null,null,null,null,null,null,null,null,null,null,null,null,null,null,null,null,null,null,null,null,null,null,null,null,null,null,null,null,null,null,null,null,null,null,null,null,null,null,"São João da Pesqueira",7,null,null,null,null,null,null,null,null,null,null,null,null,null,null,null,null,null,null,null,null,null,null,null,null,null,null,null,null,null,null,null,null,"Ovar"]
[null,null,null,null,null,null,null,null,null,null,null,null,null,null,null,null,null,null,null,null,null,null,null,null,null,null,null,null,null,null,null,null,null,null,null,null,null,null,null,null,null,null,null,null,null,null,null,null,null,null,null,null,null,null,"São Pedro do Sul",15,null,null,null,null,null,null,null,null,null,null,null,null,null,null,null,null,null,null,null,null,null,null,null,null,null,null,null,null,null,null,null,null,"Paços de Ferreira"]
[null,null,null,null,null,null,null,null,null,null,null,null,null,null,null,null,null,null,null,null,null,null,null,null,null,null,null,null,null,null,null,null,null,null,null,null,null,null,null,null,null,null,null,null,null,null,null,null,null,null,null,null,null,null,"São Roque do Pico",29,null,null,null,null,null,null,null,null,null,null,null,null,null,null,null,null,null,null,null,null,null,null,null,null,null,null,null,null,null,null,null,null,"Palmela"]
[null,null,null,null,null,null,null,null,null,null,null,null,null,null,null,null,null,null,null,null,null,null,null,null,null,null,null,null,null,null,null,null,null,null,null,null,null,null,null,null,null,null,null,null,null,null,null,null,null,null,null,null,null,null,"São Vicente",30,null,null,null,null,null,null,null,null,null,null,null,null,null,null,null,null,null,null,null,null,null,null,null,null,null,null,null,null,null,null,null,null,"Pampilhosa da Serra"]
[null,null,null,null,null,null,null,null,null,null,null,null,null,null,null,null,null,null,null,null,null,null,null,null,null,null,null,null,null,null,null,null,null,null,null,null,null,null,null,null,null,null,null,null,null,null,null,null,null,null,null,null,null,null,"Sardoal",20,null,null,null,null,null,null,null,null,null,null,null,null,null,null,null,null,null,null,null,null,null,null,null,null,null,null,null,null,null,null,null,null,"Paredes"]
[null,null,null,null,null,null,null,null,null,null,null,null,null,null,null,null,null,null,null,null,null,null,null,null,null,null,null,null,null,null,null,null,null,null,null,null,null,null,null,null,null,null,null,null,null,null,null,null,null,null,null,null,null,null,"Sátão",15,null,null,null,null,null,null,null,null,null,null,null,null,null,null,null,null,null,null,null,null,null,null,null,null,null,null,null,null,null,null,null,null,"Paredes de Coura"]
[null,null,null,null,null,null,null,null,null,null,null,null,null,null,null,null,null,null,null,null,null,null,null,null,null,null,null,null,null,null,null,null,null,null,null,null,null,null,null,null,null,null,null,null,null,null,null,null,null,null,null,null,null,null,"Seia",14,null,null,null,null,null,null,null,null,null,null,null,null,null,null,null,null,null,null,null,null,null,null,null,null,null,null,null,null,null,null,null,null,"Pedrógão Grande"]
[null,null,null,null,null,null,null,null,null,null,null,null,null,null,null,null,null,null,null,null,null,null,null,null,null,null,null,null,null,null,null,null,null,null,null,null,null,null,null,null,null,null,null,null,null,null,null,null,null,null,null,null,null,null,"Seixal",23,null,null,null,null,null,null,null,null,null,null,null,null,null,null,null,null,null,null,null,null,null,null,null,null,null,null,null,null,null,null,null,null,"Penacova"]
[null,null,null,null,null,null,null,null,null,null,null,null,null,null,null,null,null,null,null,null,null,null,null,null,null,null,null,null,null,null,null,null,null,null,null,null,null,null,null,null,null,null,null,null,null,null,null,null,null,null,null,null,null,null,"Sernancelhe",7,null,null,null,null,null,null,null,null,null,null,null,null,null,null,null,null,null,null,null,null,null,null,null,null,null,null,null,null,null,null,null,null,"Penafiel"]
[null,null,null,null,null,null,null,null,null,null,null,null,null,null,null,null,null,null,null,null,null,null,null,null,null,null,null,null,null,null,null,null,null,null,null,null,null,null,null,null,null,null,null,null,null,null,null,null,null,null,null,null,null,null,"Serpa",27,null,null,null,null,null,null,null,null,null,null,null,null,null,null,null,null,null,null,null,null,null,null,null,null,null,null,null,null,null,null,null,null,"Penalva do Castelo"]
[null,null,null,null,null,null,null,null,null,null,null,null,null,null,null,null,null,null,null,null,null,null,null,null,null,null,null,null,null,null,null,null,null,null,null,null,null,null,null,null,null,null,null,null,null,null,null,null,null,null,null,null,null,null,"Sertã",17,null,null,null,null,null,null,null,null,null,null,null,null,null,null,null,null,null,null,null,null,null,null,null,null,null,null,null,null,null,null,null,null,"Penamacor"]
[null,null,null,null,null,null,null,null,null,null,null,null,null,null,null,null,null,null,null,null,null,null,null,null,null,null,null,null,null,null,null,null,null,null,null,null,null,null,null,null,null,null,null,null,null,null,null,null,null,null,null,null,null,null,"Sesimbra",23,null,null,null,null,null,null,null,null,null,null,null,null,null,null,null,null,null,null,null,null,null,null,null,null,null,null,null,null,null,null,null,null,"Penedono"]
[null,null,null,null,null,null,null,null,null,null,null,null,null,null,null,null,null,null,null,null,null,null,null,null,null,null,null,null,null,null,null,null,null,null,null,null,null,null,null,null,null,null,null,null,null,null,null,null,null,null,null,null,null,null,"Setúbal",23,null,null,null,null,null,null,null,null,null,null,null,null,null,null,null,null,null,null,null,null,null,null,null,null,null,null,null,null,null,null,null,null,"Penela"]
[null,null,null,null,null,null,null,null,null,null,null,null,null,null,null,null,null,null,null,null,null,null,null,null,null,null,null,null,null,null,null,null,null,null,null,null,null,null,null,null,null,null,null,null,null,null,null,null,null,null,null,null,null,null,"Sever do Vouga",9,null,null,null,null,null,null,null,null,null,null,null,null,null,null,null,null,null,null,null,null,null,null,null,null,null,null,null,null,null,null,null,null,"Peniche"]
[null,null,null,null,null,null,null,null,null,null,null,null,null,null,null,null,null,null,null,null,null,null,null,null,null,null,null,null,null,null,null,null,null,null,null,null,null,null,null,null,null,null,null,null,null,null,null,null,null,null,null,null,null,null,"Silves",28,null,null,null,null,null,null,null,null,null,null,null,null,null,null,null,null,null,null,null,null,null,null,null,null,null,null,null,null,null,null,null,null,"Peso da Régua"]
[null,null,null,null,null,null,null,null,null,null,null,null,null,null,null,null,null,null,null,null,null,null,null,null,null,null,null,null,null,null,null,null,null,null,null,null,null,null,null,null,null,null,null,null,null,null,null,null,null,null,null,null,null,null,"Sines",26,null,null,null,null,null,null,null,null,null,null,null,null,null,null,null,null,null,null,null,null,null,null,null,null,null,null,null,null,null,null,null,null,"Pinhel"]
[null,null,null,null,null,null,null,null,null,null,null,null,null,null,null,null,null,null,null,null,null,null,null,null,null,null,null,null,null,null,null,null,null,null,null,null,null,null,null,null,null,null,null,null,null,null,null,null,null,null,null,null,null,null,"Sintra",22,null,null,null,null,null,null,null,null,null,null,null,null,null,null,null,null,null,null,null,null,null,null,null,null,null,null,null,null,null,null,null,null,"Pombal"]
[null,null,null,null,null,null,null,null,null,null,null,null,null,null,null,null,null,null,null,null,null,null,null,null,null,null,null,null,null,null,null,null,null,null,null,null,null,null,null,null,null,null,null,null,null,null,null,null,null,null,null,null,null,null,"Sobral de Monte Agraço",19,null,null,null,null,null,null,null,null,null,null,null,null,null,null,null,null,null,null,null,null,null,null,null,null,null,null,null,null,null,null,null,null,"Ponta Delgada"]
[null,null,null,null,null,null,null,null,null,null,null,null,null,null,null,null,null,null,null,null,null,null,null,null,null,null,null,null,null,null,null,null,null,null,null,null,null,null,null,null,null,null,null,null,null,null,null,null,null,null,null,null,null,null,"Soure",10,null,null,null,null,null,null,null,null,null,null,null,null,null,null,null,null,null,null,null,null,null,null,null,null,null,null,null,null,null,null,null,null,"Ponta do Sol"]
[null,null,null,null,null,null,null,null,null,null,null,null,null,null,null,null,null,null,null,null,null,null,null,null,null,null,null,null,null,null,null,null,null,null,null,null,null,null,null,null,null,null,null,null,null,null,null,null,null,null,null,null,null,null,"Sousel",25,null,null,null,null,null,null,null,null,null,null,null,null,null,null,null,null,null,null,null,null,null,null,null,null,null,null,null,null,null,null,null,null,"Ponte da Barca",null,null,null,null,null,null,null,null,null,null,null,null,null,null,null,null,null,null,null,null,null,null,null,null,null,null,null,null,null,null,null,null,null,null,null,null,null,null,null,null,null,null,null,null,null,null,null,null,null,null,null,null,null,null,null,null,null,null,null,null,null,null,null,null,null,null,null,null,null,null,null,null,null,null,null,null,null,null,null,null,null,null,null,null,null,null,null,null,null,null,null,null,null,null,null,null,null,null,null,null,null,null,null,null,null,null,null,null,null,null,null,null,null,null,null,null,null,null,null,null,null,null,null,null,null,null,null,null,null,null,null,null,null,null,null,null,null,null,null,null,null,null,null,null,null,null,null,null,null,null,null,null,null,null,null,null,null,null,null,null,null,null,null,null,null,null,null,null,null,null,null,null,null,null,null,null,null,null,null,null,null,null,null,null,null,null,null,null,null,null,null,null,null,null,null,null,null,null,null,null,null,null,null,null,null,null,null,null,null,null,null,null,null,null,null,null,null,null,null,null,null,null,null,null,null,null,null,null,null,null,null,null,null,null,null,null,null,null,null,null,null,null,null,null,null,null,null,null,null,null,null,null,null,null,null,null,null,null,null,null,null,null,null,null,null,null,null,null,null,null,null,null,null,null,null,null,null,null,null,null,null,null,null,null,null,null,null,null,null,null,null,null,null,null,null,null,null,null,null,null,null,null,null,null,null,null,null,null,null,null,null,null,null,null,null,null,null,null,null,null,null,null,null,null,null,null,null,null,null,null,null,null,null,null,null,null,null,null,null,null,null,null,null,null,null,null,null,null,null,null,null,null,null,null,null,null,null,null,null,null,null,null,null,null,null,null,null,null,null,null,null,null,null,null,null,null,null,null,null,null,null,null,null,null,null,null,null,null,null,null,null,null,null,null,null,null,null,null,null,null,null,null,null,null,null,null,null,null,null,null,null,null,null,null,null,null,null,"Layers",null,"Material 1",null,null,"Indicator",null,null,null,null,null,"Unit Consumption",null,null,null,null,null,"Material 2",null,null,"Indicator",null,null,null,null,null,"Unit Consumption",null,null,null,null,null,"Indicator 1",null,null,"Indicator 2"]
[null,null,null,null,null,null,null,null,null,null,null,null,null,null,null,null,null,null,null,null,null,null,null,null,null,null,null,null,null,null,null,null,null,null,null,null,null,null,null,null,null,null,null,null,null,null,null,null,null,null,null,null,null,null,"Tábua",16,null,null,null,null,null,null,null,null,null,null,null,null,null,null,null,null,null,null,null,null,null,null,null,null,null,null,null,null,null,null,null,null,"Ponte de Lima",null,null,null,null,null,null,null,null,null,null,null,null,null,null,null,null,null,null,null,null,null,null,null,null,null,null,null,null,null,null,null,null,null,null,null,null,null,null,null,null,null,null,null,null,null,null,null,null,null,null,null,null,null,null,null,null,null,null,null,null,null,null,null,null,null,null,null,null,null,null,null,null,null,null,null,null,null,null,null,null,null,null,null,null,null,null,null,null,null,null,null,null,null,null,null,null,null,null,null,null,null,null,null,null,null,null,null,null,null,null,null,null,null,null,null,null,null,null,null,null,null,null,null,null,null,null,null,null,null,null,null,null,null,null,null,null,null,null,null,null,null,null,null,null,null,null,null,null,null,null,null,null,null,null,null,null,null,null,null,null,null,null,null,null,null,null,null,null,null,null,null,null,null,null,null,null,null,null,null,null,null,null,null,null,null,null,null,null,null,null,null,null,null,null,null,null,null,null,null,null,null,null,null,null,null,null,null,null,null,null,null,null,null,null,null,null,null,null,null,null,null,null,null,null,null,null,null,null,null,null,null,null,null,null,null,null,null,null,null,null,null,null,null,null,null,null,null,null,null,null,null,null,null,null,null,null,null,null,null,null,null,null,null,null,null,null,null,null,null,null,null,null,null,null,null,null,null,null,null,null,null,null,null,null,null,null,null,null,null,null,null,null,null,null,null,null,null,null,null,null,null,null,null,null,null,null,null,null,null,null,null,null,null,null,null,null,null,null,null,null,null,null,null,null,null,null,null,null,null,null,null,null,null,null,null,null,null,null,null,null,null,null,null,null,null,null,null,null,null,null,null,null,null,null,null,null,null,null,null,null,null,null,null,null,null,null,null,null,null,null,null,null,null,null,null,null,null,null,null,null,null,null,null,null,null,null,null,null,null,null,null,null,null,null,null,null,null,null,null,null,null,null,null,null,null,null,null,null,null,null,null,null,null,null,null,null,null,"LAYER 1",null,{"$f":"CM34","v":"Gypsum Board (12,5 mm) [Gyptec]"},null,null,{"$f":"IF(VLOOKUP($HE$94,$ST$316:$SV$322,2)=1,VLOOKUP(SO271,$D$9:$L$50,24),IF(VLOOKUP($HE$94,$ST$316:$SV$322,2)=2,VLOOKUP(SO271,$D$9:$L$50,26),IF(VLOOKUP($HE$94,$ST$316:$SV$322,2)=3,VLOOKUP(SO271,$D$9:$L$50,16),IF(VLOOKUP($HE$94,$ST$316:$SV$322,2)=4,VLOOKUP(SO271,$D$9:$L$50,18),IF(VLOOKUP($HE$94,$ST$316:$SV$322,2)=5,VLOOKUP(SO271,$D$9:$L$50,22),IF(VLOOKUP($HE$94,$ST$316:$SV$322,2)=6,VLOOKUP(SO271,$D$9:$L$50,14),IF(VLOOKUP($HE$94,$ST$316:$SV$322,2)=7,VLOOKUP(SO271,$D$9:$L$50,20),0)))))))","v":{"$error":"#REF!"}},null,null,{"$f":"VLOOKUP($HE$94,$ST$316:$SV$322,3)","v":"kg CO2-eq"},null,null,{"$f":"IF(SO271=\"---\",0,VLOOKUP(SO271,$D$9:$L$50,31))","v":{"$error":"#REF!"}},null,null,{"$f":"IF(SO271=\"---\",0,VLOOKUP(SO271,$D$9:$L$50,32))","v":{"$error":"#REF!"}},null,null,{"$f":"CV34","v":"---"},null,null,{"$f":"IF(VLOOKUP($HE$94,$ST$316:$SV$322,2)=1,VLOOKUP(TD271,$D$9:$L$50,24),IF(VLOOKUP($HE$94,$ST$316:$SV$322,2)=2,VLOOKUP(TD271,$D$9:$L$50,26),IF(VLOOKUP($HE$94,$ST$316:$SV$322,2)=3,VLOOKUP(TD271,$D$9:$L$50,16),IF(VLOOKUP($HE$94,$ST$316:$SV$322,2)=4,VLOOKUP(TD271,$D$9:$L$50,18),IF(VLOOKUP($HE$94,$ST$316:$SV$322,2)=5,VLOOKUP(TD271,$D$9:$L$50,22),IF(VLOOKUP($HE$94,$ST$316:$SV$322,2)=6,VLOOKUP(TD271,$D$9:$L$50,14),IF(VLOOKUP($HE$94,$ST$316:$SV$322,2)=7,VLOOKUP(TD271,$D$9:$L$50,20),0)))))))","v":{"$error":"#REF!"}},null,null,{"$f":"SU271","v":"kg CO2-eq"},null,null,{"$f":"IF(TD271=\"---\",0,VLOOKUP(TD271,$D$9:$L$50,31))","v":0},null,null,{"$f":"IF(TD271=\"---\",0,VLOOKUP(TD271,$D$9:$L$50,32))","v":0},null,null,{"$f":"SR271*SX271","v":{"$error":"#REF!"}},null,null,{"$f":"TG271*TM271","v":{"$error":"#REF!"}}]
[null,null,null,null,null,null,null,null,null,null,null,null,null,null,null,null,null,null,null,null,null,null,null,null,null,null,null,null,null,null,null,null,null,null,null,null,null,null,null,null,null,null,null,null,null,null,null,null,null,null,null,null,null,null,"Tabuaço",7,null,null,null,null,null,null,null,null,null,null,null,null,null,null,null,null,null,null,null,null,null,null,null,null,null,null,null,null,null,null,null,null,"Ponte de Sor",null,null,null,null,null,null,null,null,null,null,null,null,null,null,null,null,null,null,null,null,null,null,null,null,null,null,null,null,null,null,null,null,null,null,null,null,null,null,null,null,null,null,null,null,null,null,null,null,null,null,null,null,null,null,null,null,null,null,null,null,null,null,null,null,null,null,null,null,null,null,null,null,null,null,null,null,null,null,null,null,null,null,null,null,null,null,null,null,null,null,null,null,null,null,null,null,null,null,null,null,null,null,null,null,null,null,null,null,null,null,null,null,null,null,null,null,null,null,null,null,null,null,null,null,null,null,null,null,null,null,null,null,null,null,null,null,null,null,null,null,null,null,null,null,null,null,null,null,null,null,null,null,null,null,null,null,null,null,null,null,null,null,null,null,null,null,null,null,null,null,null,null,null,null,null,null,null,null,null,null,null,null,null,null,null,null,null,null,null,null,null,null,null,null,null,null,null,null,null,null,null,null,null,null,null,null,null,null,null,null,null,null,null,null,null,null,null,null,null,null,null,null,null,null,null,null,null,null,null,null,null,null,null,null,null,null,null,null,null,null,null,null,null,null,null,null,null,null,null,null,null,null,null,null,null,null,null,null,null,null,null,null,null,null,null,null,null,null,null,null,null,null,null,null,null,null,null,null,null,null,null,null,null,null,null,null,null,null,null,null,null,null,null,null,null,null,null,null,null,null,null,null,null,null,null,null,null,null,null,null,null,null,null,null,null,null,null,null,null,null,null,null,null,null,null,null,null,null,null,null,null,null,null,null,null,null,null,null,null,null,null,null,null,null,null,null,null,null,null,null,null,null,null,null,null,null,null,null,null,null,null,null,null,null,null,null,null,null,null,null,null,null,null,null,null,null,null,null,null,null,null,null,null,null,null,null,null,null,null,null,null,null,null,null,null,null,null,null,null,null,null,null,null,null,null,null,null,null,null,null,null,null,null,null,null,null,null,"LAYER 2",null,"OSB (12 mm) [Kronospan]",null,null,{"$error":"#REF!"},null,null,"kg CO2-eq",null,null,{"$error":"#REF!"},null,null,{"$error":"#REF!"},null,null,"---",null,null,{"$error":"#REF!"},null,null,{"$f":"SU272","v":"kg CO2-eq"},null,null,0,null,null,0,null,null,{"$f":"SR272*SX272","v":{"$error":"#REF!"}},null,null,{"$f":"TG272*TM272","v":{"$error":"#REF!"}}]
[null,null,null,null,null,null,null,null,null,null,null,null,null,null,null,null,null,null,null,null,null,null,null,null,null,null,null,null,null,null,null,null,null,null,null,null,null,null,null,null,null,null,null,null,null,null,null,null,null,null,null,null,null,null,"Tarouca",7,null,null,null,null,null,null,null,null,null,null,null,null,null,null,null,null,null,null,null,null,null,null,null,null,null,null,null,null,null,null,null,null,"Portalegre",null,null,null,null,null,null,null,null,null,null,null,null,null,null,null,null,null,null,null,null,null,null,null,null,null,null,null,null,null,null,null,null,null,null,null,null,null,null,null,null,null,null,null,null,null,null,null,null,null,null,null,null,null,null,null,null,null,null,null,null,null,null,null,null,null,null,null,null,null,null,null,null,null,null,null,null,null,null,null,null,null,null,null,null,null,null,null,null,null,null,null,null,null,null,null,null,null,null,null,null,null,null,null,null,null,null,null,null,null,null,null,null,null,null,null,null,null,null,null,null,null,null,null,null,null,null,null,null,null,null,null,null,null,null,null,null,null,null,null,null,null,null,null,null,null,null,null,null,null,null,null,null,null,null,null,null,null,null,null,null,null,null,null,null,null,null,null,null,null,null,null,null,null,null,null,null,null,null,null,null,null,null,null,null,null,null,null,null,null,null,null,null,null,null,null,null,null,null,null,null,null,null,null,null,null,null,null,null,null,null,null,null,null,null,null,null,null,null,null,null,null,null,null,null,null,null,null,null,null,null,null,null,null,null,null,null,null,null,null,null,null,null,null,null,null,null,null,null,null,null,null,null,null,null,null,null,null,null,null,null,null,null,null,null,null,null,null,null,null,null,null,null,null,null,null,null,null,null,null,null,null,null,null,null,null,null,null,null,null,null,null,null,null,null,null,null,null,null,null,null,null,null,null,null,null,null,null,null,null,null,null,null,null,null,null,null,null,null,null,null,null,null,null,null,null,null,null,null,null,null,null,null,null,null,null,null,null,null,null,null,null,null,null,null,null,null,null,null,null,null,null,null,null,null,null,null,null,null,null,null,null,null,null,null,null,null,null,null,null,null,null,null,null,null,null,null,null,null,null,null,null,null,null,null,null,null,null,null,null,null,null,null,null,null,null,null,null,null,null,null,null,null,null,null,null,null,null,null,null,null,null,null,null,null,null,null,null,"LAYER 3",null,"Air Cavity (10 mm) [ISO 6946]",null,null,{"$error":"#REF!"},null,null,"kg CO2-eq",null,null,{"$error":"#REF!"},null,null,{"$error":"#REF!"},null,null,"TB Strip XPS (10 mm) [IFoam]",null,null,{"$error":"#REF!"},null,null,"kg CO2-eq",null,null,{"$error":"#REF!"},null,null,{"$error":"#REF!"},null,null,{"$error":"#REF!"},null,null,{"$error":"#REF!"}]
[null,null,null,null,null,null,null,null,null,null,null,null,null,null,null,null,null,null,null,null,null,null,null,null,null,null,null,null,null,null,null,null,null,null,null,null,null,null,null,null,null,null,null,null,null,null,null,null,null,null,null,null,null,null,"Tavira",28,null,null,null,null,null,null,null,null,null,null,null,null,null,null,null,null,null,null,null,null,null,null,null,null,null,null,null,null,null,null,null,null,"Portel",null,null,null,null,null,null,null,null,null,null,null,null,null,null,null,null,null,null,null,null,null,null,null,null,null,null,null,null,null,null,null,null,null,null,null,null,null,null,null,null,null,null,null,null,null,null,null,null,null,null,null,null,null,null,null,null,null,null,null,null,null,null,null,null,null,null,null,null,null,null,null,null,null,null,null,null,null,null,null,null,null,null,null,null,null,null,null,null,null,null,null,null,null,null,null,null,null,null,null,null,null,null,null,null,null,null,null,null,null,null,null,null,null,null,null,null,null,null,null,null,null,null,null,null,null,null,null,null,null,null,null,null,null,null,null,null,null,null,null,null,null,null,null,null,null,null,null,null,null,null,null,null,null,null,null,null,null,null,null,null,null,null,null,null,null,null,null,null,null,null,null,null,null,null,null,null,null,null,null,null,null,null,null,null,null,null,null,null,null,null,null,null,null,null,null,null,null,null,null,null,null,null,null,null,null,null,null,null,null,null,null,null,null,null,null,null,null,null,null,null,null,null,null,null,null,null,null,null,null,null,null,null,null,null,null,null,null,null,null,null,null,null,null,null,null,null,null,null,null,null,null,null,null,null,null,null,null,null,null,null,null,null,null,null,null,null,null,null,null,null,null,null,null,null,null,null,null,null,null,null,null,null,null,null,null,null,null,null,null,null,null,null,null,null,null,null,null,null,null,null,null,null,null,null,null,null,null,null,null,null,null,null,null,null,null,null,null,null,null,null,null,null,null,null,null,null,null,null,null,null,null,null,null,null,null,null,null,null,null,null,null,null,null,null,null,null,null,null,null,null,null,null,null,null,null,null,null,null,null,null,null,null,null,null,null,null,null,null,null,null,null,null,null,null,null,null,null,null,null,null,null,null,null,null,null,null,null,null,null,null,null,null,null,null,null,null,null,null,null,null,null,null,null,null,null,null,null,null,null,null,null,null,null,null,null,null,null,"LAYER 4",null,"Mineral wool (90 mm) [Volcalis]",null,null,{"$error":"#REF!"},null,null,"kg CO2-eq",null,null,{"$error":"#REF!"},null,null,{"$error":"#REF!"},null,null,"Steel C90/U93 (90 mm) [Pertecno]",null,null,{"$error":"#REF!"},null,null,"kg CO2-eq",null,null,{"$error":"#REF!"},null,null,{"$error":"#REF!"},null,null,{"$error":"#REF!"},null,null,{"$error":"#REF!"}]
[null,null,null,null,null,null,null,null,null,null,null,null,null,null,null,null,null,null,null,null,null,null,null,null,null,null,null,null,null,null,null,null,null,null,null,null,null,null,null,null,null,null,null,null,null,null,null,null,null,null,null,null,null,null,"Terras de Bouro",3,null,null,null,null,null,null,null,null,null,null,null,null,null,null,null,null,null,null,null,null,null,null,null,null,null,null,null,null,null,null,null,null,"Portimão",null,null,null,null,null,null,null,null,null,null,null,null,null,null,null,null,null,null,null,null,null,null,null,null,null,null,null,null,null,null,null,null,null,null,null,null,null,null,null,null,null,null,null,null,null,null,null,null,null,null,null,null,null,null,null,null,null,null,null,null,null,null,null,null,null,null,null,null,null,null,null,null,null,null,null,null,null,null,null,null,null,null,null,null,null,null,null,null,null,null,null,null,null,null,null,null,null,null,null,null,null,null,null,null,null,null,null,null,null,null,null,null,null,null,null,null,null,null,null,null,null,null,null,null,null,null,null,null,null,null,null,null,null,null,null,null,null,null,null,null,null,null,null,null,null,null,null,null,null,null,null,null,null,null,null,null,null,null,null,null,null,null,null,null,null,null,null,null,null,null,null,null,null,null,null,null,null,null,null,null,null,null,null,null,null,null,null,null,null,null,null,null,null,null,null,null,null,null,null,null,null,null,null,null,null,null,null,null,null,null,null,null,null,null,null,null,null,null,null,null,null,null,null,null,null,null,null,null,null,null,null,null,null,null,null,null,null,null,null,null,null,null,null,null,null,null,null,null,null,null,null,null,null,null,null,null,null,null,null,null,null,null,null,null,null,null,null,null,null,null,null,null,null,null,null,null,null,null,null,null,null,null,null,null,null,null,null,null,null,null,null,null,null,null,null,null,null,null,null,null,null,null,null,null,null,null,null,null,null,null,null,null,null,null,null,null,null,null,null,null,null,null,null,null,null,null,null,null,null,null,null,null,null,null,null,null,null,null,null,null,null,null,null,null,null,null,null,null,null,null,null,null,null,null,null,null,null,null,null,null,null,null,null,null,null,null,null,null,null,null,null,null,null,null,null,null,null,null,null,null,null,null,null,null,null,null,null,null,null,null,null,null,null,null,null,null,null,null,null,null,null,null,null,null,null,null,null,null,null,null,null,null,null,null,null,null,null,"LAYER 5",null,"Air Cavity (10 mm) [ISO 6946]",null,null,{"$error":"#REF!"},null,null,"kg CO2-eq",null,null,{"$error":"#REF!"},null,null,{"$error":"#REF!"},null,null,"TB Strip XPS (10 mm) [IFoam]",null,null,{"$error":"#REF!"},null,null,"kg CO2-eq",null,null,{"$error":"#REF!"},null,null,{"$error":"#REF!"},null,null,{"$error":"#REF!"},null,null,{"$error":"#REF!"}]
[null,null,null,null,null,null,null,null,null,null,null,null,null,null,null,null,null,null,null,null,null,null,null,null,null,null,null,null,null,null,null,null,null,null,null,null,null,null,null,null,null,null,null,null,null,null,null,null,null,null,null,null,null,null,"Tomar",20,null,null,null,null,null,null,null,null,null,null,null,null,null,null,null,null,null,null,null,null,null,null,null,null,null,null,null,null,null,null,null,null,"Porto",null,null,null,null,null,null,null,null,null,null,null,null,null,null,null,null,null,null,null,null,null,null,null,null,null,null,null,null,null,null,null,null,null,null,null,null,null,null,null,null,null,null,null,null,null,null,null,null,null,null,null,null,null,null,null,null,null,null,null,null,null,null,null,null,null,null,null,null,null,null,null,null,null,null,null,null,null,null,null,null,null,null,null,null,null,null,null,null,null,null,null,null,null,null,null,null,null,null,null,null,null,null,null,null,null,null,null,null,null,null,null,null,null,null,null,null,null,null,null,null,null,null,null,null,null,null,null,null,null,null,null,null,null,null,null,null,null,null,null,null,null,null,null,null,null,null,null,null,null,null,null,null,null,null,null,null,null,null,null,null,null,null,null,null,null,null,null,null,null,null,null,null,null,null,null,null,null,null,null,null,null,null,null,null,null,null,null,null,null,null,null,null,null,null,null,null,null,null,null,null,null,null,null,null,null,null,null,null,null,null,null,null,null,null,null,null,null,null,null,null,null,null,null,null,null,null,null,null,null,null,null,null,null,null,null,null,null,null,null,null,null,null,null,null,null,null,null,null,null,null,null,null,null,null,null,null,null,null,null,null,null,null,null,null,null,null,null,null,null,null,null,null,null,null,null,null,null,null,null,null,null,null,null,null,null,null,null,null,null,null,null,null,null,null,null,null,null,null,null,null,null,null,null,null,null,null,null,null,null,null,null,null,null,null,null,null,null,null,null,null,null,null,null,null,null,null,null,null,null,null,null,null,null,null,null,null,null,null,null,null,null,null,null,null,null,null,null,null,null,null,null,null,null,null,null,null,null,null,null,null,null,null,null,null,null,null,null,null,null,null,null,null,null,null,null,null,null,null,null,null,null,null,null,null,null,null,null,null,null,null,null,null,null,null,null,null,null,null,null,null,null,null,null,null,null,null,null,null,null,null,null,null,null,null,null,null,null,"LAYER 6",null,"OSB (12 mm) [Kronospan]",null,null,{"$error":"#REF!"},null,null,"kg CO2-eq",null,null,{"$error":"#REF!"},null,null,{"$error":"#REF!"},null,null,"---",null,null,{"$error":"#REF!"},null,null,"kg CO2-eq",null,null,0,null,null,0,null,null,{"$error":"#REF!"},null,null,{"$error":"#REF!"}]
[null,null,null,null,null,null,null,null,null,null,null,null,null,null,null,null,null,null,null,null,null,null,null,null,null,null,null,null,null,null,null,null,null,null,null,null,null,null,null,null,null,null,null,null,null,null,null,null,null,null,null,null,null,null,"Tondela",15,null,null,null,null,null,null,null,null,null,null,null,null,null,null,null,null,null,null,null,null,null,null,null,null,null,null,null,null,null,null,null,null,"Porto de Mós",null,null,null,null,null,null,null,null,null,null,null,null,null,null,null,null,null,null,null,null,null,null,null,null,null,null,null,null,null,null,null,null,null,null,null,null,null,null,null,null,null,null,null,null,null,null,null,null,null,null,null,null,null,null,null,null,null,null,null,null,null,null,null,null,null,null,null,null,null,null,null,null,null,null,null,null,null,null,null,null,null,null,null,null,null,null,null,null,null,null,null,null,null,null,null,null,null,null,null,null,null,null,null,null,null,null,null,null,null,null,null,null,null,null,null,null,null,null,null,null,null,null,null,null,null,null,null,null,null,null,null,null,null,null,null,null,null,null,null,null,null,null,null,null,null,null,null,null,null,null,null,null,null,null,null,null,null,null,null,null,null,null,null,null,null,null,null,null,null,null,null,null,null,null,null,null,null,null,null,null,null,null,null,null,null,null,null,null,null,null,null,null,null,null,null,null,null,null,null,null,null,null,null,null,null,null,null,null,null,null,null,null,null,null,null,null,null,null,null,null,null,null,null,null,null,null,null,null,null,null,null,null,null,null,null,null,null,null,null,null,null,null,null,null,null,null,null,null,null,null,null,null,null,null,null,null,null,null,null,null,null,null,null,null,null,null,null,null,null,null,null,null,null,null,null,null,null,null,null,null,null,null,null,null,null,null,null,null,null,null,null,null,null,null,null,null,null,null,null,null,null,null,null,null,null,null,null,null,null,null,null,null,null,null,null,null,null,null,null,null,null,null,null,null,null,null,null,null,null,null,null,null,null,null,null,null,null,null,null,null,null,null,null,null,null,null,null,null,null,null,null,null,null,null,null,null,null,null,null,null,null,null,null,null,null,null,null,null,null,null,null,null,null,null,null,null,null,null,null,null,null,null,null,null,null,null,null,null,null,null,null,null,null,null,null,null,null,null,null,null,null,null,null,null,null,null,null,null,null,null,null,null,null,null,null,null,null,"LAYER 7",null,"Mortar (10 mm)",null,null,{"$error":"#REF!"},null,null,"kg CO2-eq",null,null,{"$error":"#REF!"},null,null,{"$error":"#REF!"},null,null,"---",null,null,{"$error":"#REF!"},null,null,"kg CO2-eq",null,null,0,null,null,0,null,null,{"$error":"#REF!"},null,null,{"$error":"#REF!"}]
[null,null,null,null,null,null,null,null,null,null,null,null,null,null,null,null,null,null,null,null,null,null,null,null,null,null,null,null,null,null,null,null,null,null,null,null,null,null,null,null,null,null,null,null,null,null,null,null,null,null,null,null,null,null,"Torre de Moncorvo",7,null,null,null,null,null,null,null,null,null,null,null,null,null,null,null,null,null,null,null,null,null,null,null,null,null,null,null,null,null,null,null,null,"Porto Moniz",null,null,null,null,null,null,null,null,null,null,null,null,null,null,null,null,null,null,null,null,null,null,null,null,null,null,null,null,null,null,null,null,null,null,null,null,null,null,null,null,null,null,null,null,null,null,null,null,null,null,null,null,null,null,null,null,null,null,null,null,null,null,null,null,null,null,null,null,null,null,null,null,null,null,null,null,null,null,null,null,null,null,null,null,null,null,null,null,null,null,null,null,null,null,null,null,null,null,null,null,null,null,null,null,null,null,null,null,null,null,null,null,null,null,null,null,null,null,null,null,null,null,null,null,null,null,null,null,null,null,null,null,null,null,null,null,null,null,null,null,null,null,null,null,null,null,null,null,null,null,null,null,null,null,null,null,null,null,null,null,null,null,null,null,null,null,null,null,null,null,null,null,null,null,null,null,null,null,null,null,null,null,null,null,null,null,null,null,null,null,null,null,null,null,null,null,null,null,null,null,null,null,null,null,null,null,null,null,null,null,null,null,null,null,null,null,null,null,null,null,null,null,null,null,null,null,null,null,null,null,null,null,null,null,null,null,null,null,null,null,null,null,null,null,null,null,null,null,null,null,null,null,null,null,null,null,null,null,null,null,null,null,null,null,null,null,null,null,null,null,null,null,null,null,null,null,null,null,null,null,null,null,null,null,null,null,null,null,null,null,null,null,null,null,null,null,null,null,null,null,null,null,null,null,null,null,null,null,null,null,null,null,null,null,null,null,null,null,null,null,null,null,null,null,null,null,null,null,null,null,null,null,null,null,null,null,null,null,null,null,null,null,null,null,null,null,null,null,null,null,null,null,null,null,null,null,null,null,null,null,null,null,null,null,null,null,null,null,null,null,null,null,null,null,null,null,null,null,null,null,null,null,null,null,null,null,null,null,null,null,null,null,null,null,null,null,null,null,null,null,null,null,null,null,null,null,null,null,null,null,null,null,null,null,null,null,null,"LAYER 8",null,"---",null,null,{"$error":"#REF!"},null,null,"kg CO2-eq",null,null,0,null,null,0,null,null,"---",null,null,{"$error":"#REF!"},null,null,"kg CO2-eq",null,null,0,null,null,0,null,null,{"$error":"#REF!"},null,null,{"$error":"#REF!"}]
[null,null,null,null,null,null,null,null,null,null,null,null,null,null,null,null,null,null,null,null,null,null,null,null,null,null,null,null,null,null,null,null,null,null,null,null,null,null,null,null,null,null,null,null,null,null,null,null,null,null,null,null,null,null,"Torres Novas",20,null,null,null,null,null,null,null,null,null,null,null,null,null,null,null,null,null,null,null,null,null,null,null,null,null,null,null,null,null,null,null,null,"Porto Santo",null,null,null,null,null,null,null,null,null,null,null,null,null,null,null,null,null,null,null,null,null,null,null,null,null,null,null,null,null,null,null,null,null,null,null,null,null,null,null,null,null,null,null,null,null,null,null,null,null,null,null,null,null,null,null,null,null,null,null,null,null,null,null,null,null,null,null,null,null,null,null,null,null,null,null,null,null,null,null,null,null,null,null,null,null,null,null,null,null,null,null,null,null,null,null,null,null,null,null,null,null,null,null,null,null,null,null,null,null,null,null,null,null,null,null,null,null,null,null,null,null,null,null,null,null,null,null,null,null,null,null,null,null,null,null,null,null,null,null,null,null,null,null,null,null,null,null,null,null,null,null,null,null,null,null,null,null,null,null,null,null,null,null,null,null,null,null,null,null,null,null,null,null,null,null,null,null,null,null,null,null,null,null,null,null,null,null,null,null,null,null,null,null,null,null,null,null,null,null,null,null,null,null,null,null,null,null,null,null,null,null,null,null,null,null,null,null,null,null,null,null,null,null,null,null,null,null,null,null,null,null,null,null,null,null,null,null,null,null,null,null,null,null,null,null,null,null,null,null,null,null,null,null,null,null,null,null,null,null,null,null,null,null,null,null,null,null,null,null,null,null,null,null,null,null,null,null,null,null,null,null,null,null,null,null,null,null,null,null,null,null,null,null,null,null,null,null,null,null,null,null,null,null,null,null,null,null,null,null,null,null,null,null,null,null,null,null,null,null,null,null,null,null,null,null,null,null,null,null,null,null,null,null,null,null,null,null,null,null,null,null,null,null,null,null,null,null,null,null,null,null,null,null,null,null,null,null,null,null,null,null,null,null,null,null,null,null,null,null,null,null,null,null,null,null,null,null,null,null,null,null,null,null,null,null,null,null,null,null,null,null,null,null,null,null,null,null,null,null,null,null,null,null,null,null,null,null,null,null,null,null,null,null,null,null,null,null,"LAYER 9",null,"---",null,null,{"$error":"#REF!"},null,null,"kg CO2-eq",null,null,0,null,null,0,null,null,"---",null,null,{"$error":"#REF!"},null,null,"kg CO2-eq",null,null,0,null,null,0,null,null,{"$error":"#REF!"},null,null,{"$error":"#REF!"}]
[null,null,null,null,null,null,null,null,null,null,null,null,null,null,null,null,null,null,null,null,null,null,null,null,null,null,null,null,null,null,null,null,null,null,null,null,null,null,null,null,null,null,null,null,null,null,null,null,null,null,null,null,null,null,"Torres Vedras",19,null,null,null,null,null,null,null,null,null,null,null,null,null,null,null,null,null,null,null,null,null,null,null,null,null,null,null,null,null,null,null,null,"Póvoa de Lanhoso",null,null,null,null,null,null,null,null,null,null,null,null,null,null,null,null,null,null,null,null,null,null,null,null,null,null,null,null,null,null,null,null,null,null,null,null,null,null,null,null,null,null,null,null,null,null,null,null,null,null,null,null,null,null,null,null,null,null,null,null,null,null,null,null,null,null,null,null,null,null,null,null,null,null,null,null,null,null,null,null,null,null,null,null,null,null,null,null,null,null,null,null,null,null,null,null,null,null,null,null,null,null,null,null,null,null,null,null,null,null,null,null,null,null,null,null,null,null,null,null,null,null,null,null,null,null,null,null,null,null,null,null,null,null,null,null,null,null,null,null,null,null,null,null,null,null,null,null,null,null,null,null,null,null,null,null,null,null,null,null,null,null,null,null,null,null,null,null,null,null,null,null,null,null,null,null,null,null,null,null,null,null,null,null,null,null,null,null,null,null,null,null,null,null,null,null,null,null,null,null,null,null,null,null,null,null,null,null,null,null,null,null,null,null,null,null,null,null,null,null,null,null,null,null,null,null,null,null,null,null,null,null,null,null,null,null,null,null,null,null,null,null,null,null,null,null,null,null,null,null,null,null,null,null,null,null,null,null,null,null,null,null,null,null,null,null,null,null,null,null,null,null,null,null,null,null,null,null,null,null,null,null,null,null,null,null,null,null,null,null,null,null,null,null,null,null,null,null,null,null,null,null,null,null,null,null,null,null,null,null,null,null,null,null,null,null,null,null,null,null,null,null,null,null,null,null,null,null,null,null,null,null,null,null,null,null,null,null,null,null,null,null,null,null,null,null,null,null,null,null,null,null,null,null,null,null,null,null,null,null,null,null,null,null,null,null,null,null,null,null,null,null,null,null,null,null,null,null,null,null,null,null,null,null,null,null,null,null,null,null,null,null,null,null,null,null,null,null,null,null,null,null,null,null,null,null,null,null,null,null,null,null,null,null,null,null,null,"LAYER 10",null,"---",null,null,{"$error":"#REF!"},null,null,"kg CO2-eq",null,null,0,null,null,0,null,null,"---",null,null,{"$error":"#REF!"},null,null,"kg CO2-eq",null,null,0,null,null,0,null,null,{"$error":"#REF!"},null,null,{"$error":"#REF!"}]
[null,null,null,null,null,null,null,null,null,null,null,null,null,null,null,null,null,null,null,null,null,null,null,null,null,null,null,null,null,null,null,null,null,null,null,null,null,null,null,null,null,null,null,null,null,null,null,null,null,null,null,null,null,null,"Trancoso",11,null,null,null,null,null,null,null,null,null,null,null,null,null,null,null,null,null,null,null,null,null,null,null,null,null,null,null,null,null,null,null,null,"Póvoa de Varzim",null,null,null,null,null,null,null,null,null,null,null,null,null,null,null,null,null,null,null,null,null,null,null,null,null,null,null,null,null,null,null,null,null,null,null,null,null,null,null,null,null,null,null,null,null,null,null,null,null,null,null,null,null,null,null,null,null,null,null,null,null,null,null,null,null,null,null,null,null,null,null,null,null,null,null,null,null,null,null,null,null,null,null,null,null,null,null,null,null,null,null,null,null,null,null,null,null,null,null,null,null,null,null,null,null,null,null,null,null,null,null,null,null,null,null,null,null,null,null,null,null,null,null,null,null,null,null,null,null,null,null,null,null,null,null,null,null,null,null,null,null,null,null,null,null,null,null,null,null,null,null,null,null,null,null,null,null,null,null,null,null,null,null,null,null,null,null,null,null,null,null,null,null,null,null,null,null,null,null,null,null,null,null,null,null,null,null,null,null,null,null,null,null,null,null,null,null,null,null,null,null,null,null,null,null,null,null,null,null,null,null,null,null,null,null,null,null,null,null,null,null,null,null,null,null,null,null,null,null,null,null,null,null,null,null,null,null,null,null,null,null,null,null,null,null,null,null,null,null,null,null,null,null,null,null,null,null,null,null,null,null,null,null,null,null,null,null,null,null,null,null,null,null,null,null,null,null,null,null,null,null,null,null,null,null,null,null,null,null,null,null,null,null,null,null,null,null,null,null,null,null,null,null,null,null,null,null,null,null,null,null,null,null,null,null,null,null,null,null,null,null,null,null,null,null,null,null,null,null,null,null,null,null,null,null,null,null,null,null,null,null,null,null,null,null,null,null,null,null,null,null,null,null,null,null,null,null,null,null,null,null,null,null,null,null,null,null,null,null,null,null,null,null,null,null,null,null,null,null,null,null,null,null,null,null,null,null,null,null,null,null,null,null,null,null,null,null,null,null,null,null,null,null,null,null,null,null,null,null,null,null,null,null,null,null,null,null,null,null,null,null,null,null,null,null,null,null,null,null,null,null,null,null,null,null,null,null,null,null,null,null,null,null,null,null,null,null,"Total",null,{"$f":"SUM(TS271:TU280)+SUM(TV271:TX280)","v":{"$error":"#REF!"}}]
[null,null,null,null,null,null,null,null,null,null,null,null,null,null,null,null,null,null,null,null,null,null,null,null,null,null,null,null,null,null,null,null,null,null,null,null,null,null,null,null,null,null,null,null,null,null,null,null,null,null,null,null,null,null,"Trofa",5,null,null,null,null,null,null,null,null,null,null,null,null,null,null,null,null,null,null,null,null,null,null,null,null,null,null,null,null,null,null,null,null,"Povoação"]
[null,null,null,null,null,null,null,null,null,null,null,null,null,null,null,null,null,null,null,null,null,null,null,null,null,null,null,null,null,null,null,null,null,null,null,null,null,null,null,null,null,null,null,null,null,null,null,null,null,null,null,null,null,null,"Vagos",9,null,null,null,null,null,null,null,null,null,null,null,null,null,null,null,null,null,null,null,null,null,null,null,null,null,null,null,null,null,null,null,null,"Praia da Vitória"]
[null,null,null,null,null,null,null,null,null,null,null,null,null,null,null,null,null,null,null,null,null,null,null,null,null,null,null,null,null,null,null,null,null,null,null,null,null,null,null,null,null,null,null,null,null,null,null,null,null,null,null,null,null,null,"Vale de Cambra",8,null,null,null,null,null,null,null,null,null,null,null,null,null,null,null,null,null,null,null,null,null,null,null,null,null,null,null,null,null,null,null,null,"Proença-a-Nova"]
[null,null,null,null,null,null,null,null,null,null,null,null,null,null,null,null,null,null,null,null,null,null,null,null,null,null,null,null,null,null,null,null,null,null,null,null,null,null,null,null,null,null,null,null,null,null,null,null,null,null,null,null,null,null,"Valença",1,null,null,null,null,null,null,null,null,null,null,null,null,null,null,null,null,null,null,null,null,null,null,null,null,null,null,null,null,null,null,null,null,"Redondo",null,null,null,null,null,null,null,null,null,null,null,null,null,null,null,null,null,null,null,null,null,null,null,null,null,null,null,null,null,null,null,null,null,null,null,null,null,null,null,null,null,null,null,null,null,null,null,null,null,null,null,null,null,null,null,null,null,null,null,null,null,null,null,null,null,null,null,null,null,null,null,null,null,null,null,null,null,null,null,null,null,null,null,null,null,null,null,null,null,null,null,null,null,null,null,null,null,null,null,null,null,null,null,null,null,null,null,null,null,null,null,null,null,null,null,null,null,null,null,null,null,null,null,null,null,null,null,null,null,null,null,null,null,null,null,null,null,null,null,null,null,null,null,null,null,null,null,null,null,null,null,null,null,null,null,null,null,null,null,null,null,null,null,null,null,null,null,null,null,null,null,null,null,null,null,null,null,null,null,null,null,null,null,null,null,null,null,null,null,null,null,null,null,null,null,null,null,null,null,null,null,null,null,null,null,null,null,null,null,null,null,null,null,null,null,null,null,null,null,null,null,null,null,null,null,null,null,null,null,null,null,null,null,null,null,null,null,null,null,null,null,null,null,null,null,null,null,null,null,null,null,null,null,null,null,null,null,null,null,null,null,null,null,null,null,null,null,null,null,null,null,null,null,null,null,null,null,null,null,null,null,null,null,null,null,null,null,null,null,null,null,null,null,null,null,null,null,null,null,null,null,null,null,null,null,null,null,null,{"$f":"IF(VLOOKUP($CS287,#REF!,2)=1,AO$10,IF(VLOOKUP($CS287,#REF!,2)=2,AO$11,\"---\"))","v":{"$error":"#REF!"}},null,null,null,null,null,null,null,null,null,null,null,null,null,null,null,null,null,null,null,null,null,null,null,null,null,null,null,null,null,null,null,null,null,null,null,null,null,null,null,null,null,null,null,null,null,null,null,null,null,null,null,null,null,null,null,null,null,null,null,null,null,null,null,null,null,null,null,null,null,null,null,null,null,null,null,null,null,null,null,null,null,null,null,null,null,null,null,null,null,null,null,null,null,null,null,null,null,null,null,null,null,null,null,null,null,null,null,null,"Layers",null,"Material 1",null,null,"Indicator",null,null,null,null,null,"Unit Consumption",null,null,null,null,null,"Material 2",null,null,"Indicator",null,null,null,null,null,"Unit Consumption",null,null,null,null,null,"Indicator 1",null,null,"Indicator 2"]
[null,null,null,null,null,null,null,null,null,null,null,null,null,null,null,null,null,null,null,null,null,null,null,null,null,null,null,null,null,null,null,null,null,null,null,null,null,null,null,null,null,null,null,null,null,null,null,null,null,null,null,null,null,null,"Valongo",5,null,null,null,null,null,null,null,null,null,null,null,null,null,null,null,null,null,null,null,null,null,null,null,null,null,null,null,null,null,null,null,null,"Reguengos de Monsaraz",null,null,null,null,null,null,null,null,null,null,null,null,null,null,null,null,null,null,null,null,null,null,null,null,null,null,null,null,null,null,null,null,null,null,null,null,null,null,null,null,null,null,null,null,null,null,null,null,null,null,null,null,null,null,null,null,null,null,null,null,null,null,null,null,null,null,null,null,null,null,null,null,null,null,null,null,null,null,null,null,null,null,null,null,null,null,null,null,null,null,null,null,null,null,null,null,null,null,null,null,null,null,null,null,null,null,null,null,null,null,null,null,null,null,null,null,null,null,null,null,null,null,null,null,null,null,null,null,null,null,null,null,null,null,null,null,null,null,null,null,null,null,null,null,null,null,null,null,null,null,null,null,null,null,null,null,null,null,null,null,null,null,null,null,null,null,null,null,null,null,null,null,null,null,null,null,null,null,null,null,null,null,null,null,null,null,null,null,null,null,null,null,null,null,null,null,null,null,null,null,null,null,null,null,null,null,null,null,null,null,null,null,null,null,null,null,null,null,null,null,null,null,null,null,null,null,null,null,null,null,null,null,null,null,null,null,null,null,null,null,null,null,null,null,null,null,null,null,null,null,null,null,null,null,null,null,null,null,null,null,null,null,null,null,null,null,null,null,null,null,null,null,null,null,null,null,null,null,null,null,null,null,null,null,null,null,null,null,null,null,null,null,null,null,null,null,null,null,null,null,null,null,null,null,null,null,null,null,null,null,null,null,null,null,null,null,null,null,null,null,null,null,null,null,null,null,null,null,null,null,null,null,null,null,null,null,null,null,null,null,null,null,null,null,null,null,null,null,null,null,null,null,null,null,null,null,null,null,null,null,null,null,null,null,null,null,null,null,null,null,null,null,null,null,null,null,null,null,null,null,null,null,null,null,null,null,null,null,null,null,null,null,null,null,null,null,null,null,null,null,null,null,null,null,null,null,null,null,null,null,null,null,null,null,null,null,null,"LAYER 1",null,{"$f":"CM14","v":"Gypsum Board (12,5 mm) [Gyptec]"},null,null,{"$f":"IF(VLOOKUP($HE$123,$ST$316:$SV$322,2)=1,VLOOKUP(SO286,$D$9:$L$50,24),IF(VLOOKUP($HE$123,$ST$316:$SV$322,2)=2,VLOOKUP(SO286,$D$9:$L$50,26),IF(VLOOKUP($HE$123,$ST$316:$SV$322,2)=3,VLOOKUP(SO286,$D$9:$L$50,16),IF(VLOOKUP($HE$123,$ST$316:$SV$322,2)=4,VLOOKUP(SO286,$D$9:$L$50,18),IF(VLOOKUP($HE$123,$ST$316:$SV$322,2)=5,VLOOKUP(SO286,$D$9:$L$50,22),IF(VLOOKUP($HE$123,$ST$316:$SV$322,2)=6,VLOOKUP(SO286,$D$9:$L$50,14),IF(VLOOKUP($HE$123,$ST$316:$SV$322,2)=7,VLOOKUP(SO286,$D$9:$L$50,20),0)))))))","v":{"$error":"#REF!"}},null,null,{"$f":"VLOOKUP($HE$123,$ST$316:$SV$322,3)","v":"kg CO2-eq"},null,null,{"$f":"IF(SO286=\"---\",0,VLOOKUP(SO286,$D$9:$L$50,31))","v":{"$error":"#REF!"}},null,null,{"$f":"IF(SO286=\"---\",0,VLOOKUP(SO286,$D$9:$L$50,32))","v":{"$error":"#REF!"}},null,null,{"$f":"CV14","v":"---"},null,null,{"$f":"IF(VLOOKUP($HE$123,$ST$316:$SV$322,2)=1,VLOOKUP(TD286,$D$9:$L$50,24),IF(VLOOKUP($HE$123,$ST$316:$SV$322,2)=2,VLOOKUP(TD286,$D$9:$L$50,26),IF(VLOOKUP($HE$123,$ST$316:$SV$322,2)=3,VLOOKUP(TD286,$D$9:$L$50,16),IF(VLOOKUP($HE$123,$ST$316:$SV$322,2)=4,VLOOKUP(TD286,$D$9:$L$50,18),IF(VLOOKUP($HE$123,$ST$316:$SV$322,2)=5,VLOOKUP(TD286,$D$9:$L$50,22),IF(VLOOKUP($HE$123,$ST$316:$SV$322,2)=6,VLOOKUP(TD286,$D$9:$L$50,14),IF(VLOOKUP($HE$123,$ST$316:$SV$322,2)=7,VLOOKUP(TD286,$D$9:$L$50,20),0)))))))","v":{"$error":"#REF!"}},null,null,{"$f":"SU286","v":"kg CO2-eq"},null,null,{"$f":"IF(TD286=\"---\",0,VLOOKUP(TD286,$D$9:$L$50,31))","v":0},null,null,{"$f":"IF(TD286=\"---\",0,VLOOKUP(TD286,$D$9:$L$50,32))","v":0},null,null,{"$f":"SR286*SX286","v":{"$error":"#REF!"}},null,null,{"$f":"TG286*TM286","v":{"$error":"#REF!"}}]
[null,null,null,null,null,null,null,null,null,null,null,null,null,null,null,null,null,null,null,null,null,null,null,null,null,null,null,null,null,null,null,null,null,null,null,null,null,null,null,null,null,null,null,null,null,null,null,null,null,null,null,null,null,null,"Valpaços",2,null,null,null,null,null,null,null,null,null,null,null,null,null,null,null,null,null,null,null,null,null,null,null,null,null,null,null,null,null,null,null,null,"Resende",null,null,null,null,null,null,null,null,null,null,null,null,null,null,null,null,null,null,null,null,null,null,null,null,null,null,null,null,null,null,null,null,null,null,null,null,null,null,null,null,null,null,null,null,null,null,null,null,null,null,null,null,null,null,null,null,null,null,null,null,null,null,null,null,null,null,null,null,null,null,null,null,null,null,null,null,null,null,null,null,null,null,null,null,null,null,null,null,null,null,null,null,null,null,null,null,null,null,null,null,null,null,null,null,null,null,null,null,null,null,null,null,null,null,null,null,null,null,null,null,null,null,null,null,null,null,null,null,null,null,null,null,null,null,null,null,null,null,null,null,null,null,null,null,null,null,null,null,null,null,null,null,null,null,null,null,null,null,null,null,null,null,null,null,null,null,null,null,null,null,null,null,null,null,null,null,null,null,null,null,null,null,null,null,null,null,null,null,null,null,null,null,null,null,null,null,null,null,null,null,null,null,null,null,null,null,null,null,null,null,null,null,null,null,null,null,null,null,null,null,null,null,null,null,null,null,null,null,null,null,null,null,null,null,null,null,null,null,null,null,null,null,null,null,null,null,null,null,null,null,null,null,null,null,null,null,null,null,null,null,null,null,null,null,null,null,null,null,null,null,null,null,null,null,null,null,null,null,null,null,null,null,null,null,null,null,null,null,null,null,null,null,null,null,null,null,null,null,null,null,null,null,null,null,null,null,null,null,null,null,null,null,null,null,null,null,null,null,null,null,null,null,null,null,null,null,null,null,null,null,null,null,null,null,null,null,null,null,null,null,null,null,null,null,null,null,null,null,null,null,null,null,null,null,null,null,null,null,null,null,null,null,null,null,null,null,null,null,null,null,null,null,null,null,null,null,null,null,null,null,null,null,null,null,null,null,null,null,null,null,null,null,null,null,null,null,null,null,null,null,null,null,null,null,null,null,null,null,null,null,null,null,null,null,null,null,null,"LAYER 2",null,"OSB (12 mm) [Kronospan]",null,null,{"$error":"#REF!"},null,null,"kg CO2-eq",null,null,{"$error":"#REF!"},null,null,{"$error":"#REF!"},null,null,"---",null,null,{"$error":"#REF!"},null,null,{"$f":"SU287","v":"kg CO2-eq"},null,null,0,null,null,0,null,null,{"$f":"SR287*SX287","v":{"$error":"#REF!"}},null,null,{"$f":"TG287*TM287","v":{"$error":"#REF!"}}]
[null,null,null,null,null,null,null,null,null,null,null,null,null,null,null,null,null,null,null,null,null,null,null,null,null,null,null,null,null,null,null,null,null,null,null,null,null,null,null,null,null,null,null,null,null,null,null,null,null,null,null,null,null,null,"Velas",29,null,null,null,null,null,null,null,null,null,null,null,null,null,null,null,null,null,null,null,null,null,null,null,null,null,null,null,null,null,null,null,null,"Ribeira Brava",null,null,null,null,null,null,null,null,null,null,null,null,null,null,null,null,null,null,null,null,null,null,null,null,null,null,null,null,null,null,null,null,null,null,null,null,null,null,null,null,null,null,null,null,null,null,null,null,null,null,null,null,null,null,null,null,null,null,null,null,null,null,null,null,null,null,null,null,null,null,null,null,null,null,null,null,null,null,null,null,null,null,null,null,null,null,null,null,null,null,null,null,null,null,null,null,null,null,null,null,null,null,null,null,null,null,null,null,null,null,null,null,null,null,null,null,null,null,null,null,null,null,null,null,null,null,null,null,null,null,null,null,null,null,null,null,null,null,null,null,null,null,null,null,null,null,null,null,null,null,null,null,null,null,null,null,null,null,null,null,null,null,null,null,null,null,null,null,null,null,null,null,null,null,null,null,null,null,null,null,null,null,null,null,null,null,null,null,null,null,null,null,null,null,null,null,null,null,null,null,null,null,null,null,null,null,null,null,null,null,null,null,null,null,null,null,null,null,null,null,null,null,null,null,null,null,null,null,null,null,null,null,null,null,null,null,null,null,null,null,null,null,null,null,null,null,null,null,null,null,null,null,null,null,null,null,null,null,null,null,null,null,null,null,null,null,null,null,null,null,null,null,null,null,null,null,null,null,null,null,null,null,null,null,null,null,null,null,null,null,null,null,null,null,null,null,null,null,null,null,null,null,null,null,null,null,null,null,null,null,null,null,null,null,null,null,null,null,null,null,null,null,null,null,null,null,null,null,null,null,null,null,null,null,null,null,null,null,null,null,null,null,null,null,null,null,null,null,null,null,null,null,null,null,null,null,null,null,null,null,null,null,null,null,null,null,null,null,null,null,null,null,null,null,null,null,null,null,null,null,null,null,null,null,null,null,null,null,null,null,null,null,null,null,null,null,null,null,null,null,null,null,null,null,null,null,null,null,null,null,null,null,null,null,null,null,null,"LAYER 3",null,"Mineral wool (90 mm) [Volcalis]",null,null,{"$error":"#REF!"},null,null,"kg CO2-eq",null,null,{"$error":"#REF!"},null,null,{"$error":"#REF!"},null,null,"Steel C90/U93 (90 mm) [Pertecno]",null,null,{"$error":"#REF!"},null,null,"kg CO2-eq",null,null,{"$error":"#REF!"},null,null,{"$error":"#REF!"},null,null,{"$error":"#REF!"},null,null,{"$error":"#REF!"}]
[null,null,null,null,null,null,null,null,null,null,null,null,null,null,null,null,null,null,null,null,null,null,null,null,null,null,null,null,null,null,null,null,null,null,null,null,null,null,null,null,null,null,null,null,null,null,null,null,null,null,null,null,null,null,"Vendas Novas",25,null,null,null,null,null,null,null,null,null,null,null,null,null,null,null,null,null,null,null,null,null,null,null,null,null,null,null,null,null,null,null,null,"Ribeira de Pena",null,null,null,null,null,null,null,null,null,null,null,null,null,null,null,null,null,null,null,null,null,null,null,null,null,null,null,null,null,null,null,null,null,null,null,null,null,null,null,null,null,null,null,null,null,null,null,null,null,null,null,null,null,null,null,null,null,null,null,null,null,null,null,null,null,null,null,null,null,null,null,null,null,null,null,null,null,null,null,null,null,null,null,null,null,null,null,null,null,null,null,null,null,null,null,null,null,null,null,null,null,null,null,null,null,null,null,null,null,null,null,null,null,null,null,null,null,null,null,null,null,null,null,null,null,null,null,null,null,null,null,null,null,null,null,null,null,null,null,null,null,null,null,null,null,null,null,null,null,null,null,null,null,null,null,null,null,null,null,null,null,null,null,null,null,null,null,null,null,null,null,null,null,null,null,null,null,null,null,null,null,null,null,null,null,null,null,null,null,null,null,null,null,null,null,null,null,null,null,null,null,null,null,null,null,null,null,null,null,null,null,null,null,null,null,null,null,null,null,null,null,null,null,null,null,null,null,null,null,null,null,null,null,null,null,null,null,null,null,null,null,null,null,null,null,null,null,null,null,null,null,null,null,null,null,null,null,null,null,null,null,null,null,null,null,null,null,null,null,null,null,null,null,null,null,null,null,null,null,null,null,null,null,null,null,null,null,null,null,null,null,null,null,null,null,null,null,null,null,null,null,null,null,null,null,null,null,null,null,null,null,null,null,null,null,null,null,null,null,null,null,null,null,null,null,null,null,null,null,null,null,null,null,null,null,null,null,null,null,null,null,null,null,null,null,null,null,null,null,null,null,null,null,null,null,null,null,null,null,null,null,null,null,null,null,null,null,null,null,null,null,null,null,null,null,null,null,null,null,null,null,null,null,null,null,null,null,null,null,null,null,null,null,null,null,null,null,null,null,null,null,null,null,null,null,null,null,null,null,null,null,null,null,null,null,null,null,"LAYER 4",null,"OSB (12 mm) [Kronospan]",null,null,{"$error":"#REF!"},null,null,"kg CO2-eq",null,null,{"$error":"#REF!"},null,null,{"$error":"#REF!"},null,null,"---",null,null,{"$error":"#REF!"},null,null,"kg CO2-eq",null,null,0,null,null,0,null,null,{"$error":"#REF!"},null,null,{"$error":"#REF!"}]
[null,null,null,null,null,null,null,null,null,null,null,null,null,null,null,null,null,null,null,null,null,null,null,null,null,null,null,null,null,null,null,null,null,null,null,null,null,null,null,null,null,null,null,null,null,null,null,null,null,null,null,null,null,null,"Viana do Alentejo",25,null,null,null,null,null,null,null,null,null,null,null,null,null,null,null,null,null,null,null,null,null,null,null,null,null,null,null,null,null,null,null,null,"Ribeira Grande",null,null,null,null,null,null,null,null,null,null,null,null,null,null,null,null,null,null,null,null,null,null,null,null,null,null,null,null,null,null,null,null,null,null,null,null,null,null,null,null,null,null,null,null,null,null,null,null,null,null,null,null,null,null,null,null,null,null,null,null,null,null,null,null,null,null,null,null,null,null,null,null,null,null,null,null,null,null,null,null,null,null,null,null,null,null,null,null,null,null,null,null,null,null,null,null,null,null,null,null,null,null,null,null,null,null,null,null,null,null,null,null,null,null,null,null,null,null,null,null,null,null,null,null,null,null,null,null,null,null,null,null,null,null,null,null,null,null,null,null,null,null,null,null,null,null,null,null,null,null,null,null,null,null,null,null,null,null,null,null,null,null,null,null,null,null,null,null,null,null,null,null,null,null,null,null,null,null,null,null,null,null,null,null,null,null,null,null,null,null,null,null,null,null,null,null,null,null,null,null,null,null,null,null,null,null,null,null,null,null,null,null,null,null,null,null,null,null,null,null,null,null,null,null,null,null,null,null,null,null,null,null,null,null,null,null,null,null,null,null,null,null,null,null,null,null,null,null,null,null,null,null,null,null,null,null,null,null,null,null,null,null,null,null,null,null,null,null,null,null,null,null,null,null,null,null,null,null,null,null,null,null,null,null,null,null,null,null,null,null,null,null,null,null,null,null,null,null,null,null,null,null,null,null,null,null,null,null,null,null,null,null,null,null,null,null,null,null,null,null,null,null,null,null,null,null,null,null,null,null,null,null,null,null,null,null,null,null,null,null,null,null,null,null,null,null,null,null,null,null,null,null,null,null,null,null,null,null,null,null,null,null,null,null,null,null,null,null,null,null,null,null,null,null,null,null,null,null,null,null,null,null,null,null,null,null,null,null,null,null,null,null,null,null,null,null,null,null,null,null,null,null,null,null,null,null,null,null,null,null,null,null,null,null,null,null,null,"LAYER 5",null,"Mortar (10 mm)",null,null,{"$error":"#REF!"},null,null,"kg CO2-eq",null,null,{"$error":"#REF!"},null,null,{"$error":"#REF!"},null,null,"---",null,null,{"$error":"#REF!"},null,null,"kg CO2-eq",null,null,0,null,null,0,null,null,{"$error":"#REF!"},null,null,{"$error":"#REF!"}]
[null,null,null,null,null,null,null,null,null,null,null,null,null,null,null,null,null,null,null,null,null,null,null,null,null,null,null,null,null,null,null,null,null,null,null,null,null,null,null,null,null,null,null,null,null,null,null,null,null,null,null,null,null,null,"Viana do Castelo",1,null,null,null,null,null,null,null,null,null,null,null,null,null,null,null,null,null,null,null,null,null,null,null,null,null,null,null,null,null,null,null,null,"Rio Maior",null,null,null,null,null,null,null,null,null,null,null,null,null,null,null,null,null,null,null,null,null,null,null,null,null,null,null,null,null,null,null,null,null,null,null,null,null,null,null,null,null,null,null,null,null,null,null,null,null,null,null,null,null,null,null,null,null,null,null,null,null,null,null,null,null,null,null,null,null,null,null,null,null,null,null,null,null,null,null,null,null,null,null,null,null,null,null,null,null,null,null,null,null,null,null,null,null,null,null,null,null,null,null,null,null,null,null,null,null,null,null,null,null,null,null,null,null,null,null,null,null,null,null,null,null,null,null,null,null,null,null,null,null,null,null,null,null,null,null,null,null,null,null,null,null,null,null,null,null,null,null,null,null,null,null,null,null,null,null,null,null,null,null,null,null,null,null,null,null,null,null,null,null,null,null,null,null,null,null,null,null,null,null,null,null,null,null,null,null,null,null,null,null,null,null,null,null,null,null,null,null,null,null,null,null,null,null,null,null,null,null,null,null,null,null,null,null,null,null,null,null,null,null,null,null,null,null,null,null,null,null,null,null,null,null,null,null,null,null,null,null,null,null,null,null,null,null,null,null,null,null,null,null,null,null,null,null,null,null,null,null,null,null,null,null,null,null,null,null,null,null,null,null,null,null,null,null,null,null,null,null,null,null,null,null,null,null,null,null,null,null,null,null,null,null,null,null,null,null,null,null,null,null,null,null,null,null,null,null,null,null,null,null,null,null,null,null,null,null,null,null,null,null,null,null,null,null,null,null,null,null,null,null,null,null,null,null,null,null,null,null,null,null,null,null,null,null,null,null,null,null,null,null,null,null,null,null,null,null,null,null,null,null,null,null,null,null,null,null,null,null,null,null,null,null,null,null,null,null,null,null,null,null,null,null,null,null,null,null,null,null,null,null,null,null,null,null,null,null,null,null,null,null,null,null,null,null,null,null,null,null,null,null,null,null,null,null,"LAYER 6",null,"---",null,null,{"$error":"#REF!"},null,null,"kg CO2-eq",null,null,0,null,null,0,null,null,"---",null,null,{"$error":"#REF!"},null,null,"kg CO2-eq",null,null,0,null,null,0,null,null,{"$error":"#REF!"},null,null,{"$error":"#REF!"}]
[null,null,null,null,null,null,null,null,null,null,null,null,null,null,null,null,null,null,null,null,null,null,null,null,null,null,null,null,null,null,null,null,null,null,null,null,null,null,null,null,null,null,null,null,null,null,null,null,null,null,null,null,null,null,"Vidigueira",27,null,null,null,null,null,null,null,null,null,null,null,null,null,null,null,null,null,null,null,null,null,null,null,null,null,null,null,null,null,null,null,null,"Sabrosa",null,null,null,null,null,null,null,null,null,null,null,null,null,null,null,null,null,null,null,null,null,null,null,null,null,null,null,null,null,null,null,null,null,null,null,null,null,null,null,null,null,null,null,null,null,null,null,null,null,null,null,null,null,null,null,null,null,null,null,null,null,null,null,null,null,null,null,null,null,null,null,null,null,null,null,null,null,null,null,null,null,null,null,null,null,null,null,null,null,null,null,null,null,null,null,null,null,null,null,null,null,null,null,null,null,null,null,null,null,null,null,null,null,null,null,null,null,null,null,null,null,null,null,null,null,null,null,null,null,null,null,null,null,null,null,null,null,null,null,null,null,null,null,null,null,null,null,null,null,null,null,null,null,null,null,null,null,null,null,null,null,null,null,null,null,null,null,null,null,null,null,null,null,null,null,null,null,null,null,null,null,null,null,null,null,null,null,null,null,null,null,null,null,null,null,null,null,null,null,null,null,null,null,null,null,null,null,null,null,null,null,null,null,null,null,null,null,null,null,null,null,null,null,null,null,null,null,null,null,null,null,null,null,null,null,null,null,null,null,null,null,null,null,null,null,null,null,null,null,null,null,null,null,null,null,null,null,null,null,null,null,null,null,null,null,null,null,null,null,null,null,null,null,null,null,null,null,null,null,null,null,null,null,null,null,null,null,null,null,null,null,null,null,null,null,null,null,null,null,null,null,null,null,null,null,null,null,null,null,null,null,null,null,null,null,null,null,null,null,null,null,null,null,null,null,null,null,null,null,null,null,null,null,null,null,null,null,null,null,null,null,null,null,null,null,null,null,null,null,null,null,null,null,null,null,null,null,null,null,null,null,null,null,null,null,null,null,null,null,null,null,null,null,null,null,null,null,null,null,null,null,null,null,null,null,null,null,null,null,null,null,null,null,null,null,null,null,null,null,null,null,null,null,null,null,null,null,null,null,null,null,null,null,null,null,null,null,"LAYER 7",null,"---",null,null,{"$error":"#REF!"},null,null,"kg CO2-eq",null,null,0,null,null,0,null,null,"---",null,null,{"$error":"#REF!"},null,null,"kg CO2-eq",null,null,0,null,null,0,null,null,{"$error":"#REF!"},null,null,{"$error":"#REF!"}]
[null,null,null,null,null,null,null,null,null,null,null,null,null,null,null,null,null,null,null,null,null,null,null,null,null,null,null,null,null,null,null,null,null,null,null,null,null,null,null,null,null,null,null,null,null,null,null,null,null,null,null,null,null,null,"Vieira do Minho",4,null,null,null,null,null,null,null,null,null,null,null,null,null,null,null,null,null,null,null,null,null,null,null,null,null,null,null,null,null,null,null,null,"Sabugal",null,null,null,null,null,null,null,null,null,null,null,null,null,null,null,null,null,null,null,null,null,null,null,null,null,null,null,null,null,null,null,null,null,null,null,null,null,null,null,null,null,null,null,null,null,null,null,null,null,null,null,null,null,null,null,null,null,null,null,null,null,null,null,null,null,null,null,null,null,null,null,null,null,null,null,null,null,null,null,null,null,null,null,null,null,null,null,null,null,null,null,null,null,null,null,null,null,null,null,null,null,null,null,null,null,null,null,null,null,null,null,null,null,null,null,null,null,null,null,null,null,null,null,null,null,null,null,null,null,null,null,null,null,null,null,null,null,null,null,null,null,null,null,null,null,null,null,null,null,null,null,null,null,null,null,null,null,null,null,null,null,null,null,null,null,null,null,null,null,null,null,null,null,null,null,null,null,null,null,null,null,null,null,null,null,null,null,null,null,null,null,null,null,null,null,null,null,null,null,null,null,null,null,null,null,null,null,null,null,null,null,null,null,null,null,null,null,null,null,null,null,null,null,null,null,null,null,null,null,null,null,null,null,null,null,null,null,null,null,null,null,null,null,null,null,null,null,null,null,null,null,null,null,null,null,null,null,null,null,null,null,null,null,null,null,null,null,null,null,null,null,null,null,null,null,null,null,null,null,null,null,null,null,null,null,null,null,null,null,null,null,null,null,null,null,null,null,null,null,null,null,null,null,null,null,null,null,null,null,null,null,null,null,null,null,null,null,null,null,null,null,null,null,null,null,null,null,null,null,null,null,null,null,null,null,null,null,null,null,null,null,null,null,null,null,null,null,null,null,null,null,null,null,null,null,null,null,null,null,null,null,null,null,null,null,null,null,null,null,null,null,null,null,null,null,null,null,null,null,null,null,null,null,null,null,null,null,null,null,null,null,null,null,null,null,null,null,null,null,null,null,null,null,null,null,null,null,null,null,null,null,null,null,null,null,null,null,"LAYER 8",null,"---",null,null,{"$error":"#REF!"},null,null,"kg CO2-eq",null,null,0,null,null,0,null,null,"---",null,null,{"$error":"#REF!"},null,null,"kg CO2-eq",null,null,0,null,null,0,null,null,{"$error":"#REF!"},null,null,{"$error":"#REF!"}]
[null,null,null,null,null,null,null,null,null,null,null,null,null,null,null,null,null,null,null,null,null,null,null,null,null,null,null,null,null,null,null,null,null,null,null,null,null,null,null,null,null,null,null,null,null,null,null,null,null,null,null,null,null,null,"Vila de Rei",17,null,null,null,null,null,null,null,null,null,null,null,null,null,null,null,null,null,null,null,null,null,null,null,null,null,null,null,null,null,null,null,null,"Salvaterra de Magos",null,null,null,null,null,null,null,null,null,null,null,null,null,null,null,null,null,null,null,null,null,null,null,null,null,null,null,null,null,null,null,null,null,null,null,null,null,null,null,null,null,null,null,null,null,null,null,null,null,null,null,null,null,null,null,null,null,null,null,null,null,null,null,null,null,null,null,null,null,null,null,null,null,null,null,null,null,null,null,null,null,null,null,null,null,null,null,null,null,null,null,null,null,null,null,null,null,null,null,null,null,null,null,null,null,null,null,null,null,null,null,null,null,null,null,null,null,null,null,null,null,null,null,null,null,null,null,null,null,null,null,null,null,null,null,null,null,null,null,null,null,null,null,null,null,null,null,null,null,null,null,null,null,null,null,null,null,null,null,null,null,null,null,null,null,null,null,null,null,null,null,null,null,null,null,null,null,null,null,null,null,null,null,null,null,null,null,null,null,null,null,null,null,null,null,null,null,null,null,null,null,null,null,null,null,null,null,null,null,null,null,null,null,null,null,null,null,null,null,null,null,null,null,null,null,null,null,null,null,null,null,null,null,null,null,null,null,null,null,null,null,null,null,null,null,null,null,null,null,null,null,null,null,null,null,null,null,null,null,null,null,null,null,null,null,null,null,null,null,null,null,null,null,null,null,null,null,null,null,null,null,null,null,null,null,null,null,null,null,null,null,null,null,null,null,null,null,null,null,null,null,null,null,null,null,null,null,null,null,null,null,null,null,null,null,null,null,null,null,null,null,null,null,null,null,null,null,null,null,null,null,null,null,null,null,null,null,null,null,null,null,null,null,null,null,null,null,null,null,null,null,null,null,null,null,null,null,null,null,null,null,null,null,null,null,null,null,null,null,null,null,null,null,null,null,null,null,null,null,null,null,null,null,null,null,null,null,null,null,null,null,null,null,null,null,null,null,null,null,null,null,null,null,null,null,null,null,null,null,null,null,null,null,null,null,null,null,"LAYER 9",null,"---",null,null,{"$error":"#REF!"},null,null,"kg CO2-eq",null,null,0,null,null,0,null,null,"---",null,null,{"$error":"#REF!"},null,null,"kg CO2-eq",null,null,0,null,null,0,null,null,{"$error":"#REF!"},null,null,{"$error":"#REF!"}]
[null,null,null,null,null,null,null,null,null,null,null,null,null,null,null,null,null,null,null,null,null,null,null,null,null,null,null,null,null,null,null,null,null,null,null,null,null,null,null,null,null,null,null,null,null,null,null,null,null,null,null,null,null,null,"Vila do Bispo",28,null,null,null,null,null,null,null,null,null,null,null,null,null,null,null,null,null,null,null,null,null,null,null,null,null,null,null,null,null,null,null,null,"Santa Comba Dão",null,null,null,null,null,null,null,null,null,null,null,null,null,null,null,null,null,null,null,null,null,null,null,null,null,null,null,null,null,null,null,null,null,null,null,null,null,null,null,null,null,null,null,null,null,null,null,null,null,null,null,null,null,null,null,null,null,null,null,null,null,null,null,null,null,null,null,null,null,null,null,null,null,null,null,null,null,null,null,null,null,null,null,null,null,null,null,null,null,null,null,null,null,null,null,null,null,null,null,null,null,null,null,null,null,null,null,null,null,null,null,null,null,null,null,null,null,null,null,null,null,null,null,null,null,null,null,null,null,null,null,null,null,null,null,null,null,null,null,null,null,null,null,null,null,null,null,null,null,null,null,null,null,null,null,null,null,null,null,null,null,null,null,null,null,null,null,null,null,null,null,null,null,null,null,null,null,null,null,null,null,null,null,null,null,null,null,null,null,null,null,null,null,null,null,null,null,null,null,null,null,null,null,null,null,null,null,null,null,null,null,null,null,null,null,null,null,null,null,null,null,null,null,null,null,null,null,null,null,null,null,null,null,null,null,null,null,null,null,null,null,null,null,null,null,null,null,null,null,null,null,null,null,null,null,null,null,null,null,null,null,null,null,null,null,null,null,null,null,null,null,null,null,null,null,null,null,null,null,null,null,null,null,null,null,null,null,null,null,null,null,null,null,null,null,null,null,null,null,null,null,null,null,null,null,null,null,null,null,null,null,null,null,null,null,null,null,null,null,null,null,null,null,null,null,null,null,null,null,null,null,null,null,null,null,null,null,null,null,null,null,null,null,null,null,null,null,null,null,null,null,null,null,null,null,null,null,null,null,null,null,null,null,null,null,null,null,null,null,null,null,null,null,null,null,null,null,null,null,null,null,null,null,null,null,null,null,null,null,null,null,null,null,null,null,null,null,null,null,null,null,null,null,null,null,null,null,null,null,null,null,null,null,null,null,null,null,"LAYER 10",null,"---",null,null,{"$error":"#REF!"},null,null,"kg CO2-eq",null,null,0,null,null,0,null,null,"---",null,null,{"$error":"#REF!"},null,null,"kg CO2-eq",null,null,0,null,null,0,null,null,{"$error":"#REF!"},null,null,{"$error":"#REF!"}]
[null,null,null,null,null,null,null,null,null,null,null,null,null,null,null,null,null,null,null,null,null,null,null,null,null,null,null,null,null,null,null,null,null,null,null,null,null,null,null,null,null,null,null,null,null,null,null,null,null,null,null,null,null,null,"Vila do Conde",5,null,null,null,null,null,null,null,null,null,null,null,null,null,null,null,null,null,null,null,null,null,null,null,null,null,null,null,null,null,null,null,null,"Santa Cruz",null,null,null,null,null,null,null,null,null,null,null,null,null,null,null,null,null,null,null,null,null,null,null,null,null,null,null,null,null,null,null,null,null,null,null,null,null,null,null,null,null,null,null,null,null,null,null,null,null,null,null,null,null,null,null,null,null,null,null,null,null,null,null,null,null,null,null,null,null,null,null,null,null,null,null,null,null,null,null,null,null,null,null,null,null,null,null,null,null,null,null,null,null,null,null,null,null,null,null,null,null,null,null,null,null,null,null,null,null,null,null,null,null,null,null,null,null,null,null,null,null,null,null,null,null,null,null,null,null,null,null,null,null,null,null,null,null,null,null,null,null,null,null,null,null,null,null,null,null,null,null,null,null,null,null,null,null,null,null,null,null,null,null,null,null,null,null,null,null,null,null,null,null,null,null,null,null,null,null,null,null,null,null,null,null,null,null,null,null,null,null,null,null,null,null,null,null,null,null,null,null,null,null,null,null,null,null,null,null,null,null,null,null,null,null,null,null,null,null,null,null,null,null,null,null,null,null,null,null,null,null,null,null,null,null,null,null,null,null,null,null,null,null,null,null,null,null,null,null,null,null,null,null,null,null,null,null,null,null,null,null,null,null,null,null,null,null,null,null,null,null,null,null,null,null,null,null,null,null,null,null,null,null,null,null,null,null,null,null,null,null,null,null,null,null,null,null,null,null,null,null,null,null,null,null,null,null,null,null,null,null,null,null,null,null,null,null,null,null,null,null,null,null,null,null,null,null,null,null,null,null,null,null,null,null,null,null,null,null,null,null,null,null,null,null,null,null,null,null,null,null,null,null,null,null,null,null,null,null,null,null,null,null,null,null,null,null,null,null,null,null,null,null,null,null,null,null,null,null,null,null,null,null,null,null,null,null,null,null,null,null,null,null,null,null,null,null,null,null,null,null,null,null,null,null,null,null,null,null,null,null,null,null,null,null,null,null,null,null,null,null,null,null,null,null,null,null,null,null,null,null,null,null,null,null,null,null,null,null,null,null,null,null,null,null,null,null,"Total",null,{"$f":"SUM(TS286:TU295)+SUM(TV286:TX295)","v":{"$error":"#REF!"}}]
[null,null,null,null,null,null,null,null,null,null,null,null,null,null,null,null,null,null,null,null,null,null,null,null,null,null,null,null,null,null,null,null,null,null,null,null,null,null,null,null,null,null,null,null,null,null,null,null,null,null,null,null,null,null,"Vila do Corvo",29,null,null,null,null,null,null,null,null,null,null,null,null,null,null,null,null,null,null,null,null,null,null,null,null,null,null,null,null,null,null,null,null,"Santa Cruz da Graciosa"]
[null,null,null,null,null,null,null,null,null,null,null,null,null,null,null,null,null,null,null,null,null,null,null,null,null,null,null,null,null,null,null,null,null,null,null,null,null,null,null,null,null,null,null,null,null,null,null,null,null,null,null,null,null,null,"Vila do Porto",29,null,null,null,null,null,null,null,null,null,null,null,null,null,null,null,null,null,null,null,null,null,null,null,null,null,null,null,null,null,null,null,null,"Santa Cruz das Flores"]
[null,null,null,null,null,null,null,null,null,null,null,null,null,null,null,null,null,null,null,null,null,null,null,null,null,null,null,null,null,null,null,null,null,null,null,null,null,null,null,null,null,null,null,null,null,null,null,null,null,null,null,null,null,null,"Vila Flor",2,null,null,null,null,null,null,null,null,null,null,null,null,null,null,null,null,null,null,null,null,null,null,null,null,null,null,null,null,null,null,null,null,"Santa Maria da Feira",null,null,null,null,null,null,null,null,null,null,null,null,null,null,null,null,null,null,null,null,null,null,null,null,null,null,null,null,null,null,null,null,null,null,null,null,null,null,null,null,null,null,null,null,null,null,null,null,null,null,null,null,null,null,null,null,null,null,null,null,null,null,null,null,null,null,null,null,null,null,null,null,null,null,null,null,null,null,null,null,null,null,null,null,null,null,null,null,null,null,null,null,null,null,null,null,null,null,null,null,null,null,null,null,null,null,null,null,null,null,null,null,null,null,null,null,null,null,null,null,null,null,null,null,null,null,null,null,null,null,null,null,null,null,null,null,null,null,null,null,null,null,null,null,null,null,null,null,null,null,null,null,null,null,null,null,null,null,null,null,null,null,null,null,null,null,null,null,null,null,null,null,null,null,null,null,null,null,null,null,null,null,null,null,null,null,null,null,null,null,null,null,null,null,null,null,null,null,null,null,null,null,null,null,null,null,null,null,null,null,null,null,null,null,null,null,null,null,null,null,null,null,null,null,null,null,null,null,null,null,null,null,null,null,null,null,null,null,null,null,null,null,null,null,null,null,null,null,null,null,null,null,null,null,null,null,null,null,null,null,null,null,null,null,null,null,null,null,null,null,null,null,null,null,null,null,null,null,null,null,null,null,null,null,null,null,null,null,null,null,null,null,null,null,null,null,null,null,null,null,null,null,null,null,null,null,null,null,null,null,null,null,null,null,null,null,null,null,null,null,null,null,null,null,null,null,null,null,null,null,null,null,null,null,null,null,null,null,null,null,null,null,null,null,null,null,null,null,null,null,null,null,null,null,null,null,null,null,null,null,null,null,null,null,null,null,null,null,null,null,null,null,null,null,null,null,null,null,null,null,null,null,null,null,null,null,null,null,null,null,null,null,null,null,null,null,null,null,null,null,null,null,null,null,null,null,null,null,null,null,null,null,null,null,null,null,null,"Layers",null,"Material 1",null,null,"Indicator",null,null,null,null,null,"Unit Consumption",null,null,null,null,null,"Material 2",null,null,"Indicator",null,null,null,null,null,"Unit Consumption",null,null,null,null,null,"Indicator 1",null,null,"Indicator 2"]
[null,null,null,null,null,null,null,null,null,null,null,null,null,null,null,null,null,null,null,null,null,null,null,null,null,null,null,null,null,null,null,null,null,null,null,null,null,null,null,null,null,null,null,null,null,null,null,null,null,null,null,null,null,null,"Vila Franca de Xira",22,null,null,null,null,null,null,null,null,null,null,null,null,null,null,null,null,null,null,null,null,null,null,null,null,null,null,null,null,null,null,null,null,"Santa Marta de Penaguião",null,null,null,null,null,null,null,null,null,null,null,null,null,null,null,null,null,null,null,null,null,null,null,null,null,null,null,null,null,null,null,null,null,null,null,null,null,null,null,null,null,null,null,null,null,null,null,null,null,null,null,null,null,null,null,null,null,null,null,null,null,null,null,null,null,null,null,null,null,null,null,null,null,null,null,null,null,null,null,null,null,null,null,null,null,null,null,null,null,null,null,null,null,null,null,null,null,null,null,null,null,null,null,null,null,null,null,null,null,null,null,null,null,null,null,null,null,null,null,null,null,null,null,null,null,null,null,null,null,null,null,null,null,null,null,null,null,null,null,null,null,null,null,null,null,null,null,null,null,null,null,null,null,null,null,null,null,null,null,null,null,null,null,null,null,null,null,null,null,null,null,null,null,null,null,null,null,null,null,null,null,null,null,null,null,null,null,null,null,null,null,null,null,null,null,null,null,null,null,null,null,null,null,null,null,null,null,null,null,null,null,null,null,null,null,null,null,null,null,null,null,null,null,null,null,null,null,null,null,null,null,null,null,null,null,null,null,null,null,null,null,null,null,null,null,null,null,null,null,null,null,null,null,null,null,null,null,null,null,null,null,null,null,null,null,null,null,null,null,null,null,null,null,null,null,null,null,null,null,null,null,null,null,null,null,null,null,null,null,null,null,null,null,null,null,null,null,null,null,null,null,null,null,null,null,null,null,null,null,null,null,null,null,null,null,null,null,null,null,null,null,null,null,null,null,null,null,null,null,null,null,null,null,null,null,null,null,null,null,null,null,null,null,null,null,null,null,null,null,null,null,null,null,null,null,null,null,null,null,null,null,null,null,null,null,null,null,null,null,null,null,null,null,null,null,null,null,null,null,null,null,null,null,null,null,null,null,null,null,null,null,null,null,null,null,null,null,null,null,null,null,null,null,null,null,null,null,null,null,null,null,null,null,null,null,null,null,"LAYER 1",null,{"$f":"CM34","v":"Gypsum Board (12,5 mm) [Gyptec]"},null,null,{"$f":"IF(VLOOKUP($HU$89,$ST$316:$SV$322,2)=1,VLOOKUP(SO300,$D$9:$L$50,24),IF(VLOOKUP($HU$89,$ST$316:$SV$322,2)=2,VLOOKUP(SO300,$D$9:$L$50,26),IF(VLOOKUP($HU$89,$ST$316:$SV$322,2)=3,VLOOKUP(SO300,$D$9:$L$50,16),IF(VLOOKUP($HU$89,$ST$316:$SV$322,2)=4,VLOOKUP(SO300,$D$9:$L$50,18),IF(VLOOKUP($HU$89,$ST$316:$SV$322,2)=5,VLOOKUP(SO300,$D$9:$L$50,22),IF(VLOOKUP($HU$89,$ST$316:$SV$322,2)=6,VLOOKUP(SO300,$D$9:$L$50,14),IF(VLOOKUP($HU$89,$ST$316:$SV$322,2)=7,VLOOKUP(SO300,$D$9:$L$50,20),0)))))))","v":{"$error":"#N/A"}},null,null,{"$f":"VLOOKUP($HU$89,$ST$316:$SV$322,3)","v":{"$error":"#N/A"}},null,null,{"$f":"IF(SO300=\"---\",0,VLOOKUP(SO300,$D$9:$L$50,31))","v":{"$error":"#REF!"}},null,null,{"$f":"IF(SO300=\"---\",0,VLOOKUP(SO300,$D$9:$L$50,32))","v":{"$error":"#REF!"}},null,null,{"$f":"CV34","v":"---"},null,null,{"$f":"IF(VLOOKUP($HU$89,$ST$316:$SV$322,2)=1,VLOOKUP(TD300,$D$9:$L$50,24),IF(VLOOKUP($HU$89,$ST$316:$SV$322,2)=2,VLOOKUP(TD300,$D$9:$L$50,26),IF(VLOOKUP($HU$89,$ST$316:$SV$322,2)=3,VLOOKUP(TD300,$D$9:$L$50,16),IF(VLOOKUP($HU$89,$ST$316:$SV$322,2)=4,VLOOKUP(TD300,$D$9:$L$50,18),IF(VLOOKUP($HU$89,$ST$316:$SV$322,2)=5,VLOOKUP(TD300,$D$9:$L$50,22),IF(VLOOKUP($HU$89,$ST$316:$SV$322,2)=6,VLOOKUP(TD300,$D$9:$L$50,14),IF(VLOOKUP($HU$89,$ST$316:$SV$322,2)=7,VLOOKUP(TD300,$D$9:$L$50,20),0)))))))","v":{"$error":"#N/A"}},null,null,{"$f":"SU300","v":{"$error":"#N/A"}},null,null,{"$f":"IF(TD300=\"---\",0,VLOOKUP(TD300,$D$9:$L$50,31))","v":0},null,null,{"$f":"IF(TD300=\"---\",0,VLOOKUP(TD300,$D$9:$L$50,32))","v":0},null,null,{"$f":"SR300*SX300","v":{"$error":"#N/A"}},null,null,{"$f":"TG300*TM300","v":{"$error":"#N/A"}}]
[null,null,null,null,null,null,null,null,null,null,null,null,null,null,null,null,null,null,null,null,null,null,null,null,null,null,null,null,null,null,null,null,null,null,null,null,null,null,null,null,null,null,null,null,null,null,null,null,null,null,null,null,null,null,"Vila Franca do Campo",29,null,null,null,null,null,null,null,null,null,null,null,null,null,null,null,null,null,null,null,null,null,null,null,null,null,null,null,null,null,null,null,null,"Santana",null,null,null,null,null,null,null,null,null,null,null,null,null,null,null,null,null,null,null,null,null,null,null,null,null,null,null,null,null,null,null,null,null,null,null,null,null,null,null,null,null,null,null,null,null,null,null,null,null,null,null,null,null,null,null,null,null,null,null,null,null,null,null,null,null,null,null,null,null,null,null,null,null,null,null,null,null,null,null,null,null,null,null,null,null,null,null,null,null,null,null,null,null,null,null,null,null,null,null,null,null,null,null,null,null,null,null,null,null,null,null,null,null,null,null,null,null,null,null,null,null,null,null,null,null,null,null,null,null,null,null,null,null,null,null,null,null,null,null,null,null,null,null,null,null,null,null,null,null,null,null,null,null,null,null,null,null,null,null,null,null,null,null,null,null,null,null,null,null,null,null,null,null,null,null,null,null,null,null,null,null,null,null,null,null,null,null,null,null,null,null,null,null,null,null,null,null,null,null,null,null,null,null,null,null,null,null,null,null,null,null,null,null,null,null,null,null,null,null,null,null,null,null,null,null,null,null,null,null,null,null,null,null,null,null,null,null,null,null,null,null,null,null,null,null,null,null,null,null,null,null,null,null,null,null,null,null,null,null,null,null,null,null,null,null,null,null,null,null,null,null,null,null,null,null,null,null,null,null,null,null,null,null,null,null,null,null,null,null,null,null,null,null,null,null,null,null,null,null,null,null,null,null,null,null,null,null,null,null,null,null,null,null,null,null,null,null,null,null,null,null,null,null,null,null,null,null,null,null,null,null,null,null,null,null,null,null,null,null,null,null,null,null,null,null,null,null,null,null,null,null,null,null,null,null,null,null,null,null,null,null,null,null,null,null,null,null,null,null,null,null,null,null,null,null,null,null,null,null,null,null,null,null,null,null,null,null,null,null,null,null,null,null,null,null,null,null,null,null,null,null,null,null,null,null,null,null,null,null,null,null,null,null,null,null,null,null,"LAYER 2",null,"OSB (12 mm) [Kronospan]",null,null,{"$error":"#N/A"},null,null,{"$error":"#N/A"},null,null,{"$error":"#REF!"},null,null,{"$error":"#REF!"},null,null,"---",null,null,{"$error":"#N/A"},null,null,{"$f":"SU301","v":{"$error":"#N/A"}},null,null,0,null,null,0,null,null,{"$f":"SR301*SX301","v":{"$error":"#N/A"}},null,null,{"$f":"TG301*TM301","v":{"$error":"#N/A"}}]
[null,null,null,null,null,null,null,null,null,null,null,null,null,null,null,null,null,null,null,null,null,null,null,null,null,null,null,null,null,null,null,null,null,null,null,null,null,null,null,null,null,null,null,null,null,null,null,null,null,null,null,null,null,null,"Vila Nova da Barquinha",20,null,null,null,null,null,null,null,null,null,null,null,null,null,null,null,null,null,null,null,null,null,null,null,null,null,null,null,null,null,null,null,null,"Santarém",null,null,null,null,null,null,null,null,null,null,null,null,null,null,null,null,null,null,null,null,null,null,null,null,null,null,null,null,null,null,null,null,null,null,null,null,null,null,null,null,null,null,null,null,null,null,null,null,null,null,null,null,null,null,null,null,null,null,null,null,null,null,null,null,null,null,null,null,null,null,null,null,null,null,null,null,null,null,null,null,null,null,null,null,null,null,null,null,null,null,null,null,null,null,null,null,null,null,null,null,null,null,null,null,null,null,null,null,null,null,null,null,null,null,null,null,null,null,null,null,null,null,null,null,null,null,null,null,null,null,null,null,null,null,null,null,null,null,null,null,null,null,null,null,null,null,null,null,null,null,null,null,null,null,null,null,null,null,null,null,null,null,null,null,null,null,null,null,null,null,null,null,null,null,null,null,null,null,null,null,null,null,null,null,null,null,null,null,null,null,null,null,null,null,null,null,null,null,null,null,null,null,null,null,null,null,null,null,null,null,null,null,null,null,null,null,null,null,null,null,null,null,null,null,null,null,null,null,null,null,null,null,null,null,null,null,null,null,null,null,null,null,null,null,null,null,null,null,null,null,null,null,null,null,null,null,null,null,null,null,null,null,null,null,null,null,null,null,null,null,null,null,null,null,null,null,null,null,null,null,null,null,null,null,null,null,null,null,null,null,null,null,null,null,null,null,null,null,null,null,null,null,null,null,null,null,null,null,null,null,null,null,null,null,null,null,null,null,null,null,null,null,null,null,null,null,null,null,null,null,null,null,null,null,null,null,null,null,null,null,null,null,null,null,null,null,null,null,null,null,null,null,null,null,null,null,null,null,null,null,null,null,null,null,null,null,null,null,null,null,null,null,null,null,null,null,null,null,null,null,null,null,null,null,null,null,null,null,null,null,null,null,null,null,null,null,null,null,null,null,null,null,null,null,null,null,null,null,null,null,null,null,null,null,null,null,null,"LAYER 3",null,"Air Cavity (10 mm) [ISO 6946]",null,null,{"$error":"#N/A"},null,null,{"$error":"#N/A"},null,null,{"$error":"#REF!"},null,null,{"$error":"#REF!"},null,null,"TB Strip XPS (10 mm) [IFoam]",null,null,{"$error":"#N/A"},null,null,{"$error":"#N/A"},null,null,{"$error":"#REF!"},null,null,{"$error":"#REF!"},null,null,{"$error":"#N/A"},null,null,{"$error":"#N/A"}]
[null,null,null,null,null,null,null,null,null,null,null,null,null,null,null,null,null,null,null,null,null,null,null,null,null,null,null,null,null,null,null,null,null,null,null,null,null,null,null,null,null,null,null,null,null,null,null,null,null,null,null,null,null,null,"Vila Nova de Cerveira",1,null,null,null,null,null,null,null,null,null,null,null,null,null,null,null,null,null,null,null,null,null,null,null,null,null,null,null,null,null,null,null,null,"Santiago do Cacém",null,null,null,null,null,null,null,null,null,null,null,null,null,null,null,null,null,null,null,null,null,null,null,null,null,null,null,null,null,null,null,null,null,null,null,null,null,null,null,null,null,null,null,null,null,null,null,null,null,null,null,null,null,null,null,null,null,null,null,null,null,null,null,null,null,null,null,null,null,null,null,null,null,null,null,null,null,null,null,null,null,null,null,null,null,null,null,null,null,null,null,null,null,null,null,null,null,null,null,null,null,null,null,null,null,null,null,null,null,null,null,null,null,null,null,null,null,null,null,null,null,null,null,null,null,null,null,null,null,null,null,null,null,null,null,null,null,null,null,null,null,null,null,null,null,null,null,null,null,null,null,null,null,null,null,null,null,null,null,null,null,null,null,null,null,null,null,null,null,null,null,null,null,null,null,null,null,null,null,null,null,null,null,null,null,null,null,null,null,null,null,null,null,null,null,null,null,null,null,null,null,null,null,null,null,null,null,null,null,null,null,null,null,null,null,null,null,null,null,null,null,null,null,null,null,null,null,null,null,null,null,null,null,null,null,null,null,null,null,null,null,null,null,null,null,null,null,null,null,null,null,null,null,null,null,null,null,null,null,null,null,null,null,null,null,null,null,null,null,null,null,null,null,null,null,null,null,null,null,null,null,null,null,null,null,null,null,null,null,null,null,null,null,null,null,null,null,null,null,null,null,null,null,null,null,null,null,null,null,null,null,null,null,null,null,null,null,null,null,null,null,null,null,null,null,null,null,null,null,null,null,null,null,null,null,null,null,null,null,null,null,null,null,null,null,null,null,null,null,null,null,null,null,null,null,null,null,null,null,null,null,null,null,null,null,null,null,null,null,null,null,null,null,null,null,null,null,null,null,null,null,null,null,null,null,null,null,null,null,null,null,null,null,null,null,null,null,null,null,null,null,null,null,null,null,null,null,null,null,null,null,null,null,null,null,null,null,"LAYER 4",null,"Mineral wool (90 mm) [Volcalis]",null,null,{"$error":"#N/A"},null,null,{"$error":"#N/A"},null,null,{"$error":"#REF!"},null,null,{"$error":"#REF!"},null,null,"Steel C90/U93 (90 mm) [Pertecno]",null,null,{"$error":"#N/A"},null,null,{"$error":"#N/A"},null,null,{"$error":"#REF!"},null,null,{"$error":"#REF!"},null,null,{"$error":"#N/A"},null,null,{"$error":"#N/A"}]
[null,null,null,null,null,null,null,null,null,null,null,null,null,null,null,null,null,null,null,null,null,null,null,null,null,null,null,null,null,null,null,null,null,null,null,null,null,null,null,null,null,null,null,null,null,null,null,null,null,null,null,null,null,null,"Vila Nova de Famalicão",4,null,null,null,null,null,null,null,null,null,null,null,null,null,null,null,null,null,null,null,null,null,null,null,null,null,null,null,null,null,null,null,null,"Santo Tirso",null,null,null,null,null,null,null,null,null,null,null,null,null,null,null,null,null,null,null,null,null,null,null,null,null,null,null,null,null,null,null,null,null,null,null,null,null,null,null,null,null,null,null,null,null,null,null,null,null,null,null,null,null,null,null,null,null,null,null,null,null,null,null,null,null,null,null,null,null,null,null,null,null,null,null,null,null,null,null,null,null,null,null,null,null,null,null,null,null,null,null,null,null,null,null,null,null,null,null,null,null,null,null,null,null,null,null,null,null,null,null,null,null,null,null,null,null,null,null,null,null,null,null,null,null,null,null,null,null,null,null,null,null,null,null,null,null,null,null,null,null,null,null,null,null,null,null,null,null,null,null,null,null,null,null,null,null,null,null,null,null,null,null,null,null,null,null,null,null,null,null,null,null,null,null,null,null,null,null,null,null,null,null,null,null,null,null,null,null,null,null,null,null,null,null,null,null,null,null,null,null,null,null,null,null,null,null,null,null,null,null,null,null,null,null,null,null,null,null,null,null,null,null,null,null,null,null,null,null,null,null,null,null,null,null,null,null,null,null,null,null,null,null,null,null,null,null,null,null,null,null,null,null,null,null,null,null,null,null,null,null,null,null,null,null,null,null,null,null,null,null,null,null,null,null,null,null,null,null,null,null,null,null,null,null,null,null,null,null,null,null,null,null,null,null,null,null,null,null,null,null,null,null,null,null,null,null,null,null,null,null,null,null,null,null,null,null,null,null,null,null,null,null,null,null,null,null,null,null,null,null,null,null,null,null,null,null,null,null,null,null,null,null,null,null,null,null,null,null,null,null,null,null,null,null,null,null,null,null,null,null,null,null,null,null,null,null,null,null,null,null,null,null,null,null,null,null,null,null,null,null,null,null,null,null,null,null,null,null,null,null,null,null,null,null,null,null,null,null,null,null,null,null,null,null,null,null,null,null,null,null,null,null,null,null,null,null,"LAYER 5",null,"Air Cavity (10 mm) [ISO 6946]",null,null,{"$error":"#N/A"},null,null,{"$error":"#N/A"},null,null,{"$error":"#REF!"},null,null,{"$error":"#REF!"},null,null,"TB Strip XPS (10 mm) [IFoam]",null,null,{"$error":"#N/A"},null,null,{"$error":"#N/A"},null,null,{"$error":"#REF!"},null,null,{"$error":"#REF!"},null,null,{"$error":"#N/A"},null,null,{"$error":"#N/A"}]
[null,null,null,null,null,null,null,null,null,null,null,null,null,null,null,null,null,null,null,null,null,null,null,null,null,null,null,null,null,null,null,null,null,null,null,null,null,null,null,null,null,null,null,null,null,null,null,null,null,null,null,null,null,null,"Vila Nova de Foz Côa",7,null,null,null,null,null,null,null,null,null,null,null,null,null,null,null,null,null,null,null,null,null,null,null,null,null,null,null,null,null,null,null,null,"São Brás de Alportel",null,null,null,null,null,null,null,null,null,null,null,null,null,null,null,null,null,null,null,null,null,null,null,null,null,null,null,null,null,null,null,null,null,null,null,null,null,null,null,null,null,null,null,null,null,null,null,null,null,null,null,null,null,null,null,null,null,null,null,null,null,null,null,null,null,null,null,null,null,null,null,null,null,null,null,null,null,null,null,null,null,null,null,null,null,null,null,null,null,null,null,null,null,null,null,null,null,null,null,null,null,null,null,null,null,null,null,null,null,null,null,null,null,null,null,null,null,null,null,null,null,null,null,null,null,null,null,null,null,null,null,null,null,null,null,null,null,null,null,null,null,null,null,null,null,null,null,null,null,null,null,null,null,null,null,null,null,null,null,null,null,null,null,null,null,null,null,null,null,null,null,null,null,null,null,null,null,null,null,null,null,null,null,null,null,null,null,null,null,null,null,null,null,null,null,null,null,null,null,null,null,null,null,null,null,null,null,null,null,null,null,null,null,null,null,null,null,null,null,null,null,null,null,null,null,null,null,null,null,null,null,null,null,null,null,null,null,null,null,null,null,null,null,null,null,null,null,null,null,null,null,null,null,null,null,null,null,null,null,null,null,null,null,null,null,null,null,null,null,null,null,null,null,null,null,null,null,null,null,null,null,null,null,null,null,null,null,null,null,null,null,null,null,null,null,null,null,null,null,null,null,null,null,null,null,null,null,null,null,null,null,null,null,null,null,null,null,null,null,null,null,null,null,null,null,null,null,null,null,null,null,null,null,null,null,null,null,null,null,null,null,null,null,null,null,null,null,null,null,null,null,null,null,null,null,null,null,null,null,null,null,null,null,null,null,null,null,null,null,null,null,null,null,null,null,null,null,null,null,null,null,null,null,null,null,null,null,null,null,null,null,null,null,null,null,null,null,null,null,null,null,null,null,null,null,null,null,null,null,null,null,null,null,null,null,null,null,"LAYER 6",null,"OSB (12 mm) [Kronospan]",null,null,{"$error":"#N/A"},null,null,{"$error":"#N/A"},null,null,{"$error":"#REF!"},null,null,{"$error":"#REF!"},null,null,"---",null,null,{"$error":"#N/A"},null,null,{"$error":"#N/A"},null,null,0,null,null,0,null,null,{"$error":"#N/A"},null,null,{"$error":"#N/A"}]
[null,null,null,null,null,null,null,null,null,null,null,null,null,null,null,null,null,null,null,null,null,null,null,null,null,null,null,null,null,null,null,null,null,null,null,null,null,null,null,null,null,null,null,null,null,null,null,null,null,null,null,null,null,null,"Vila Nova de Gaia",5,null,null,null,null,null,null,null,null,null,null,null,null,null,null,null,null,null,null,null,null,null,null,null,null,null,null,null,null,null,null,null,null,"São João da Madeira",null,null,null,null,null,null,null,null,null,null,null,null,null,null,null,null,null,null,null,null,null,null,null,null,null,null,null,null,null,null,null,null,null,null,null,null,null,null,null,null,null,null,null,null,null,null,null,null,null,null,null,null,null,null,null,null,null,null,null,null,null,null,null,null,null,null,null,null,null,null,null,null,null,null,null,null,null,null,null,null,null,null,null,null,null,null,null,null,null,null,null,null,null,null,null,null,null,null,null,null,null,null,null,null,null,null,null,null,null,null,null,null,null,null,null,null,null,null,null,null,null,null,null,null,null,null,null,null,null,null,null,null,null,null,null,null,null,null,null,null,null,null,null,null,null,null,null,null,null,null,null,null,null,null,null,null,null,null,null,null,null,null,null,null,null,null,null,null,null,null,null,null,null,null,null,null,null,null,null,null,null,null,null,null,null,null,null,null,null,null,null,null,null,null,null,null,null,null,null,null,null,null,null,null,null,null,null,null,null,null,null,null,null,null,null,null,null,null,null,null,null,null,null,null,null,null,null,null,null,null,null,null,null,null,null,null,null,null,null,null,null,null,null,null,null,null,null,null,null,null,null,null,null,null,null,null,null,null,null,null,null,null,null,null,null,null,null,null,null,null,null,null,null,null,null,null,null,null,null,null,null,null,null,null,null,null,null,null,null,null,null,null,null,null,null,null,null,null,null,null,null,null,null,null,null,null,null,null,null,null,null,null,null,null,null,null,null,null,null,null,null,null,null,null,null,null,null,null,null,null,null,null,null,null,null,null,null,null,null,null,null,null,null,null,null,null,null,null,null,null,null,null,null,null,null,null,null,null,null,null,null,null,null,null,null,null,null,null,null,null,null,null,null,null,null,null,null,null,null,null,null,null,null,null,null,null,null,null,null,null,null,null,null,null,null,null,null,null,null,null,null,null,null,null,null,null,null,null,null,null,null,null,null,null,null,null,null,"LAYER 7",null,"Mortar (10 mm)",null,null,{"$error":"#N/A"},null,null,{"$error":"#N/A"},null,null,{"$error":"#REF!"},null,null,{"$error":"#REF!"},null,null,"---",null,null,{"$error":"#N/A"},null,null,{"$error":"#N/A"},null,null,0,null,null,0,null,null,{"$error":"#N/A"},null,null,{"$error":"#N/A"}]
[null,null,null,null,null,null,null,null,null,null,null,null,null,null,null,null,null,null,null,null,null,null,null,null,null,null,null,null,null,null,null,null,null,null,null,null,null,null,null,null,null,null,null,null,null,null,null,null,null,null,null,null,null,null,"Vila Nova de Paiva",15,null,null,null,null,null,null,null,null,null,null,null,null,null,null,null,null,null,null,null,null,null,null,null,null,null,null,null,null,null,null,null,null,"São João da Pesqueira",null,null,null,null,null,null,null,null,null,null,null,null,null,null,null,null,null,null,null,null,null,null,null,null,null,null,null,null,null,null,null,null,null,null,null,null,null,null,null,null,null,null,null,null,null,null,null,null,null,null,null,null,null,null,null,null,null,null,null,null,null,null,null,null,null,null,null,null,null,null,null,null,null,null,null,null,null,null,null,null,null,null,null,null,null,null,null,null,null,null,null,null,null,null,null,null,null,null,null,null,null,null,null,null,null,null,null,null,null,null,null,null,null,null,null,null,null,null,null,null,null,null,null,null,null,null,null,null,null,null,null,null,null,null,null,null,null,null,null,null,null,null,null,null,null,null,null,null,null,null,null,null,null,null,null,null,null,null,null,null,null,null,null,null,null,null,null,null,null,null,null,null,null,null,null,null,null,null,null,null,null,null,null,null,null,null,null,null,null,null,null,null,null,null,null,null,null,null,null,null,null,null,null,null,null,null,null,null,null,null,null,null,null,null,null,null,null,null,null,null,null,null,null,null,null,null,null,null,null,null,null,null,null,null,null,null,null,null,null,null,null,null,null,null,null,null,null,null,null,null,null,null,null,null,null,null,null,null,null,null,null,null,null,null,null,null,null,null,null,null,null,null,null,null,null,null,null,null,null,null,null,null,null,null,null,null,null,null,null,null,null,null,null,null,null,null,null,null,null,null,null,null,null,null,null,null,null,null,null,null,null,null,null,null,null,null,null,null,null,null,null,null,null,null,null,null,null,null,null,null,null,null,null,null,null,null,null,null,null,null,null,null,null,null,null,null,null,null,null,null,null,null,null,null,null,null,null,null,null,null,null,null,null,null,null,null,null,null,null,null,null,null,null,null,null,null,null,null,null,null,null,null,null,null,null,null,null,null,null,null,null,null,null,null,null,null,null,null,null,null,null,null,null,null,null,null,null,null,null,null,null,null,null,null,null,null,null,"LAYER 8",null,"---",null,null,{"$error":"#N/A"},null,null,{"$error":"#N/A"},null,null,0,null,null,0,null,null,"---",null,null,{"$error":"#N/A"},null,null,{"$error":"#N/A"},null,null,0,null,null,0,null,null,{"$error":"#N/A"},null,null,{"$error":"#N/A"}]
[null,null,null,null,null,null,null,null,null,null,null,null,null,null,null,null,null,null,null,null,null,null,null,null,null,null,null,null,null,null,null,null,null,null,null,null,null,null,null,null,null,null,null,null,null,null,null,null,null,null,null,null,null,null,"Vila Nova de Poiares",16,null,null,null,null,null,null,null,null,null,null,null,null,null,null,null,null,null,null,null,null,null,null,null,null,null,null,null,null,null,null,null,null,"São Pedro do Sul",null,null,null,null,null,null,null,null,null,null,null,null,null,null,null,null,null,null,null,null,null,null,null,null,null,null,null,null,null,null,null,null,null,null,null,null,null,null,null,null,null,null,null,null,null,null,null,null,null,null,null,null,null,null,null,null,null,null,null,null,null,null,null,null,null,null,null,null,null,null,null,null,null,null,null,null,null,null,null,null,null,null,null,null,null,null,null,null,null,null,null,null,null,null,null,null,null,null,null,null,null,null,null,null,null,null,null,null,null,null,null,null,null,null,null,null,null,null,null,null,null,null,null,null,null,null,null,null,null,null,null,null,null,null,null,null,null,null,null,null,null,null,null,null,null,null,null,null,null,null,null,null,null,null,null,null,null,null,null,null,null,null,null,null,null,null,null,null,null,null,null,null,null,null,null,null,null,null,null,null,null,null,null,null,null,null,null,null,null,null,null,null,null,null,null,null,null,null,null,null,null,null,null,null,null,null,null,null,null,null,null,null,null,null,null,null,null,null,null,null,null,null,null,null,null,null,null,null,null,null,null,null,null,null,null,null,null,null,null,null,null,null,null,null,null,null,null,null,null,null,null,null,null,null,null,null,null,null,null,null,null,null,null,null,null,null,null,null,null,null,null,null,null,null,null,null,null,null,null,null,null,null,null,null,null,null,null,null,null,null,null,null,null,null,null,null,null,null,null,null,null,null,null,null,null,null,null,null,null,null,null,null,null,null,null,null,null,null,null,null,null,null,null,null,null,null,null,null,null,null,null,null,null,null,null,null,null,null,null,null,null,null,null,null,null,null,null,null,null,null,null,null,null,null,null,null,null,null,null,null,null,null,null,null,null,null,null,null,null,null,null,null,null,null,null,null,null,null,null,null,null,null,null,null,null,null,null,null,null,null,null,null,null,null,null,null,null,null,null,null,null,null,null,null,null,null,null,null,null,null,null,null,null,null,null,null,null,"LAYER 9",null,"---",null,null,{"$error":"#N/A"},null,null,{"$error":"#N/A"},null,null,0,null,null,0,null,null,"---",null,null,{"$error":"#N/A"},null,null,{"$error":"#N/A"},null,null,0,null,null,0,null,null,{"$error":"#N/A"},null,null,{"$error":"#N/A"}]
[null,null,null,null,null,null,null,null,null,null,null,null,null,null,null,null,null,null,null,null,null,null,null,null,null,null,null,null,null,null,null,null,null,null,null,null,null,null,null,null,null,null,null,null,null,null,null,null,null,null,null,null,null,null,"Vila Pouca de Aguiar",2,null,null,null,null,null,null,null,null,null,null,null,null,null,null,null,null,null,null,null,null,null,null,null,null,null,null,null,null,null,null,null,null,"São Roque do Pico",null,null,null,null,null,null,null,null,null,null,null,null,null,null,null,null,null,null,null,null,null,null,null,null,null,null,null,null,null,null,null,null,null,null,null,null,null,null,null,null,null,null,null,null,null,null,null,null,null,null,null,null,null,null,null,null,null,null,null,null,null,null,null,null,null,null,null,null,null,null,null,null,null,null,null,null,null,null,null,null,null,null,null,null,null,null,null,null,null,null,null,null,null,null,null,null,null,null,null,null,null,null,null,null,null,null,null,null,null,null,null,null,null,null,null,null,null,null,null,null,null,null,null,null,null,null,null,null,null,null,null,null,null,null,null,null,null,null,null,null,null,null,null,null,null,null,null,null,null,null,null,null,null,null,null,null,null,null,null,null,null,null,null,null,null,null,null,null,null,null,null,null,null,null,null,null,null,null,null,null,null,null,null,null,null,null,null,null,null,null,null,null,null,null,null,null,null,null,null,null,null,null,null,null,null,null,null,null,null,null,null,null,null,null,null,null,null,null,null,null,null,null,null,null,null,null,null,null,null,null,null,null,null,null,null,null,null,null,null,null,null,null,null,null,null,null,null,null,null,null,null,null,null,null,null,null,null,null,null,null,null,null,null,null,null,null,null,null,null,null,null,null,null,null,null,null,null,null,null,null,null,null,null,null,null,null,null,null,null,null,null,null,null,null,null,null,null,null,null,null,null,null,null,null,null,null,null,null,null,null,null,null,null,null,null,null,null,null,null,null,null,null,null,null,null,null,null,null,null,null,null,null,null,null,null,null,null,null,null,null,null,null,null,null,null,null,null,null,null,null,null,null,null,null,null,null,null,null,null,null,null,null,null,null,null,null,null,null,null,null,null,null,null,null,null,null,null,null,null,null,null,null,null,null,null,null,null,null,null,null,null,null,null,null,null,null,null,null,null,null,null,null,null,null,null,null,null,null,null,null,null,null,null,null,null,null,null,"LAYER 10",null,"---",null,null,{"$error":"#N/A"},null,null,{"$error":"#N/A"},null,null,0,null,null,0,null,null,"---",null,null,{"$error":"#N/A"},null,null,{"$error":"#N/A"},null,null,0,null,null,0,null,null,{"$error":"#N/A"},null,null,{"$error":"#N/A"}]
[null,null,null,null,null,null,null,null,null,null,null,null,null,null,null,null,null,null,null,null,null,null,null,null,null,null,null,null,null,null,null,null,null,null,null,null,null,null,null,null,null,null,null,null,null,null,null,null,null,null,null,null,null,null,"Vila Real",7,null,null,null,null,null,null,null,null,null,null,null,null,null,null,null,null,null,null,null,null,null,null,null,null,null,null,null,null,null,null,null,null,"São Vicente",null,null,null,null,null,null,null,null,null,null,null,null,null,null,null,null,null,null,null,null,null,null,null,null,null,null,null,null,null,null,null,null,null,null,null,null,null,null,null,null,null,null,null,null,null,null,null,null,null,null,null,null,null,null,null,null,null,null,null,null,null,null,null,null,null,null,null,null,null,null,null,null,null,null,null,null,null,null,null,null,null,null,null,null,null,null,null,null,null,null,null,null,null,null,null,null,null,null,null,null,null,null,null,null,null,null,null,null,null,null,null,null,null,null,null,null,null,null,null,null,null,null,null,null,null,null,null,null,null,null,null,null,null,null,null,null,null,null,null,null,null,null,null,null,null,null,null,null,null,null,null,null,null,null,null,null,null,null,null,null,null,null,null,null,null,null,null,null,null,null,null,null,null,null,null,null,null,null,null,null,null,null,null,null,null,null,null,null,null,null,null,null,null,null,null,null,null,null,null,null,null,null,null,null,null,null,null,null,null,null,null,null,null,null,null,null,null,null,null,null,null,null,null,null,null,null,null,null,null,null,null,null,null,null,null,null,null,null,null,null,null,null,null,null,null,null,null,null,null,null,null,null,null,null,null,null,null,null,null,null,null,null,null,null,null,null,null,null,null,null,null,null,null,null,null,null,null,null,null,null,null,null,null,null,null,null,null,null,null,null,null,null,null,null,null,null,null,null,null,null,null,null,null,null,null,null,null,null,null,null,null,null,null,null,null,null,null,null,null,null,null,null,null,null,null,null,null,null,null,null,null,null,null,null,null,null,null,null,null,null,null,null,null,null,null,null,null,null,null,null,null,null,null,null,null,null,null,null,null,null,null,null,null,null,null,null,null,null,null,null,null,null,null,null,null,null,null,null,null,null,null,null,null,null,null,null,null,null,null,null,null,null,null,null,null,null,null,null,null,null,null,null,null,null,null,null,null,null,null,null,null,null,null,null,null,null,null,null,null,null,null,null,null,null,null,null,null,null,null,null,null,null,null,null,null,null,null,null,null,null,null,null,null,null,null,null,null,"Total",null,{"$f":"SUM(TS300:TU309)+SUM(TV300:TX309)","v":{"$error":"#N/A"}}]
[null,null,null,null,null,null,null,null,null,null,null,null,null,null,null,null,null,null,null,null,null,null,null,null,null,null,null,null,null,null,null,null,null,null,null,null,null,null,null,null,null,null,null,null,null,null,null,null,null,null,null,null,null,null,"Vila Real de Santo António",28,null,null,null,null,null,null,null,null,null,null,null,null,null,null,null,null,null,null,null,null,null,null,null,null,null,null,null,null,null,null,null,null,"Sardoal"]
[null,null,null,null,null,null,null,null,null,null,null,null,null,null,null,null,null,null,null,null,null,null,null,null,null,null,null,null,null,null,null,null,null,null,null,null,null,null,null,null,null,null,null,null,null,null,null,null,null,null,null,null,null,null,"Vila Velha de Ródão",12,null,null,null,null,null,null,null,null,null,null,null,null,null,null,null,null,null,null,null,null,null,null,null,null,null,null,null,null,null,null,null,null,"Sátão"]
[null,null,null,null,null,null,null,null,null,null,null,null,null,null,null,null,null,null,null,null,null,null,null,null,null,null,null,null,null,null,null,null,null,null,null,null,null,null,null,null,null,null,null,null,null,null,null,null,null,null,null,null,null,null,"Vila Verde",3,null,null,null,null,null,null,null,null,null,null,null,null,null,null,null,null,null,null,null,null,null,null,null,null,null,null,null,null,null,null,null,null,"Seia"]
[null,null,null,null,null,null,null,null,null,null,null,null,null,null,null,null,null,null,null,null,null,null,null,null,null,null,null,null,null,null,null,null,null,null,null,null,null,null,null,null,null,null,null,null,null,null,null,null,null,null,null,null,null,null,"Vila Viçosa",25,null,null,null,null,null,null,null,null,null,null,null,null,null,null,null,null,null,null,null,null,null,null,null,null,null,null,null,null,null,null,null,null,"Seixal",null,null,null,null,null,null,null,null,null,null,null,null,null,null,null,null,null,null,null,null,null,null,null,null,null,null,null,null,null,null,null,null,null,null,null,null,null,null,null,null,null,null,null,null,null,null,null,null,null,null,null,null,null,null,null,null,null,null,null,null,null,null,null,null,null,null,null,null,null,null,null,null,null,null,null,null,null,null,null,null,null,null,null,null,null,null,null,null,null,null,null,null,null,null,null,null,null,null,null,null,null,null,null,null,null,null,null,null,null,null,null,null,null,null,null,null,null,null,null,null,null,null,null,null,null,null,null,null,null,null,null,null,null,null,null,null,null,null,null,null,null,null,null,null,null,null,null,null,null,null,null,null,null,null,null,null,null,null,null,null,null,null,null,null,null,null,null,null,null,null,null,null,null,null,null,null,null,null,null,null,null,null,null,null,null,null,null,null,null,null,null,null,null,null,null,null,null,null,null,null,null,null,null,null,null,null,null,null,null,null,null,null,null,null,null,null,null,null,null,null,null,null,null,null,null,null,null,null,null,null,null,null,null,null,null,null,null,null,null,null,null,null,null,null,null,null,null,null,null,null,null,null,null,null,null,null,null,null,null,null,null,null,null,null,null,null,null,null,null,null,null,null,null,null,null,null,null,null,null,null,null,null,null,null,null,null,null,null,null,null,null,null,null,null,null,null,null,null,null,null,null,null,null,null,null,null,null,null,null,null,null,null,null,null,null,null,null,null,null,null,null,null,null,null,null,null,null,null,null,null,null,null,null,null,null,null,null,null,null,null,null,null,null,null,null,null,null,null,null,null,null,null,null,null,null,null,null,null,null,null,null,null,null,null,null,null,null,null,null,null,null,null,null,null,null,null,null,null,null,null,null,null,null,null,null,null,null,null,null,null,null,null,null,null,null,null,null,null,null,null,null,null,null,null,null,null,null,null,null,null,null,null,null,null,null,null,null,"LIST",null,null,null,null,null,null,"Matrix"]
[null,null,null,null,null,null,null,null,null,null,null,null,null,null,null,null,null,null,null,null,null,null,null,null,null,null,null,null,null,null,null,null,null,null,null,null,null,null,null,null,null,null,null,null,null,null,null,null,null,null,null,null,null,null,"Vimioso",2,null,null,null,null,null,null,null,null,null,null,null,null,null,null,null,null,null,null,null,null,null,null,null,null,null,null,null,null,null,null,null,null,"Sernancelhe"]
[null,null,null,null,null,null,null,null,null,null,null,null,null,null,null,null,null,null,null,null,null,null,null,null,null,null,null,null,null,null,null,null,null,null,null,null,null,null,null,null,null,null,null,null,null,null,null,null,null,null,null,null,null,null,"Vinhais",2,null,null,null,null,null,null,null,null,null,null,null,null,null,null,null,null,null,null,null,null,null,null,null,null,null,null,null,null,null,null,null,null,"Serpa",null,null,null,null,null,null,null,null,null,null,null,null,null,null,null,null,null,null,null,null,null,null,null,null,null,null,null,null,null,null,null,null,null,null,null,null,null,null,null,null,null,null,null,null,null,null,null,null,null,null,null,null,null,null,null,null,null,null,null,null,null,null,null,null,null,null,null,null,null,null,null,null,null,null,null,null,null,null,null,null,null,null,null,null,null,null,null,null,null,null,null,null,null,null,null,null,null,null,null,null,null,null,null,null,null,null,null,null,null,null,null,null,null,null,null,null,null,null,null,null,null,null,null,null,null,null,null,null,null,null,null,null,null,null,null,null,null,null,null,null,null,null,null,null,null,null,null,null,null,null,null,null,null,null,null,null,null,null,null,null,null,null,null,null,null,null,null,null,null,null,null,null,null,null,null,null,null,null,null,null,null,null,null,null,null,null,null,null,null,null,null,null,null,null,null,null,null,null,null,null,null,null,null,null,null,null,null,null,null,null,null,null,null,null,null,null,null,null,null,null,null,null,null,null,null,null,null,null,null,null,null,null,null,null,null,null,null,null,null,null,null,null,null,null,null,null,null,null,null,null,null,null,null,null,null,null,null,null,null,null,null,null,null,null,null,null,null,null,null,null,null,null,null,null,null,null,null,null,null,null,null,null,null,null,null,null,null,null,null,null,null,null,null,null,null,null,null,null,null,null,null,null,null,null,null,null,null,null,null,null,null,null,null,null,null,null,null,null,null,null,null,null,null,null,null,null,null,null,null,null,null,null,null,null,null,null,null,null,null,null,null,null,null,null,null,null,null,null,null,null,null,null,null,null,null,null,null,null,null,null,null,null,null,null,null,null,null,null,null,null,null,null,null,null,null,null,null,null,null,null,null,null,null,null,null,null,null,null,null,null,null,null,null,null,null,null,null,null,null,null,null,null,null,null,null,null,null,null,null,null,null,null,null,null,null,null,null,"Abiotic Resources Depletion Potential - Elements (ADPE)",null,null,null,null,null,null,"Abiotic Resources Depletion Potential - Elements (ADPE)",1,"kg SB-eq"]
[null,null,null,null,null,null,null,null,null,null,null,null,null,null,null,null,null,null,null,null,null,null,null,null,null,null,null,null,null,null,null,null,null,null,null,null,null,null,null,null,null,null,null,null,null,null,null,null,null,null,null,null,null,null,"Viseu",15,null,null,null,null,null,null,null,null,null,null,null,null,null,null,null,null,null,null,null,null,null,null,null,null,null,null,null,null,null,null,null,null,"Sertã",null,null,null,null,null,null,null,null,null,null,null,null,null,null,null,null,null,null,null,null,null,null,null,null,null,null,null,null,null,null,null,null,null,null,null,null,null,null,null,null,null,null,null,null,null,null,null,null,null,null,null,null,null,null,null,null,null,null,null,null,null,null,null,null,null,null,null,null,null,null,null,null,null,null,null,null,null,null,null,null,null,null,null,null,null,null,null,null,null,null,null,null,null,null,null,null,null,null,null,null,null,null,null,null,null,null,null,null,null,null,null,null,null,null,null,null,null,null,null,null,null,null,null,null,null,null,null,null,null,null,null,null,null,null,null,null,null,null,null,null,null,null,null,null,null,null,null,null,null,null,null,null,null,null,null,null,null,null,null,null,null,null,null,null,null,null,null,null,null,null,null,null,null,null,null,null,null,null,null,null,null,null,null,null,null,null,null,null,null,null,null,null,null,null,null,null,null,null,null,null,null,null,null,null,null,null,null,null,null,null,null,null,null,null,null,null,null,null,null,null,null,null,null,null,null,null,null,null,null,null,null,null,null,null,null,null,null,null,null,null,null,null,null,null,null,null,null,null,null,null,null,null,null,null,null,null,null,null,null,null,null,null,null,null,null,null,null,null,null,null,null,null,null,null,null,null,null,null,null,null,null,null,null,null,null,null,null,null,null,null,null,null,null,null,null,null,null,null,null,null,null,null,null,null,null,null,null,null,null,null,null,null,null,null,null,null,null,null,null,null,null,null,null,null,null,null,null,null,null,null,null,null,null,null,null,null,null,null,null,null,null,null,null,null,null,null,null,null,null,null,null,null,null,null,null,null,null,null,null,null,null,null,null,null,null,null,null,null,null,null,null,null,null,null,null,null,null,null,null,null,null,null,null,null,null,null,null,null,null,null,null,null,null,null,null,null,null,null,null,null,null,null,null,null,null,null,null,null,null,null,null,null,null,null,null,null,null,"Abiotic Resources Depletion Potential - Fossil Resources (ADPF)",null,null,null,null,null,null,"Abiotic Resources Depletion Potential - Fossil Resources (ADPF)",2,"MJ"]
[null,null,null,null,null,null,null,null,null,null,null,null,null,null,null,null,null,null,null,null,null,null,null,null,null,null,null,null,null,null,null,null,null,null,null,null,null,null,null,null,null,null,null,null,null,null,null,null,null,null,null,null,null,null,"Vizela",4,null,null,null,null,null,null,null,null,null,null,null,null,null,null,null,null,null,null,null,null,null,null,null,null,null,null,null,null,null,null,null,null,"Sesimbra",null,null,null,null,null,null,null,null,null,null,null,null,null,null,null,null,null,null,null,null,null,null,null,null,null,null,null,null,null,null,null,null,null,null,null,null,null,null,null,null,null,null,null,null,null,null,null,null,null,null,null,null,null,null,null,null,null,null,null,null,null,null,null,null,null,null,null,null,null,null,null,null,null,null,null,null,null,null,null,null,null,null,null,null,null,null,null,null,null,null,null,null,null,null,null,null,null,null,null,null,null,null,null,null,null,null,null,null,null,null,null,null,null,null,null,null,null,null,null,null,null,null,null,null,null,null,null,null,null,null,null,null,null,null,null,null,null,null,null,null,null,null,null,null,null,null,null,null,null,null,null,null,null,null,null,null,null,null,null,null,null,null,null,null,null,null,null,null,null,null,null,null,null,null,null,null,null,null,null,null,null,null,null,null,null,null,null,null,null,null,null,null,null,null,null,null,null,null,null,null,null,null,null,null,null,null,null,null,null,null,null,null,null,null,null,null,null,null,null,null,null,null,null,null,null,null,null,null,null,null,null,null,null,null,null,null,null,null,null,null,null,null,null,null,null,null,null,null,null,null,null,null,null,null,null,null,null,null,null,null,null,null,null,null,null,null,null,null,null,null,null,null,null,null,null,null,null,null,null,null,null,null,null,null,null,null,null,null,null,null,null,null,null,null,null,null,null,null,null,null,null,null,null,null,null,null,null,null,null,null,null,null,null,null,null,null,null,null,null,null,null,null,null,null,null,null,null,null,null,null,null,null,null,null,null,null,null,null,null,null,null,null,null,null,null,null,null,null,null,null,null,null,null,null,null,null,null,null,null,null,null,null,null,null,null,null,null,null,null,null,null,null,null,null,null,null,null,null,null,null,null,null,null,null,null,null,null,null,null,null,null,null,null,null,null,null,null,null,null,null,null,null,null,null,null,null,null,null,null,null,null,null,null,null,null,null,null,"Acidification Potential (AP)",null,null,null,null,null,null,"Acidification Potential (AP)",3,"kg SO2-eq"]
[null,null,null,null,null,null,null,null,null,null,null,null,null,null,null,null,null,null,null,null,null,null,null,null,null,null,null,null,null,null,null,null,null,null,null,null,null,null,null,null,null,null,null,null,null,null,null,null,null,null,null,null,null,null,"Vouzela",15,null,null,null,null,null,null,null,null,null,null,null,null,null,null,null,null,null,null,null,null,null,null,null,null,null,null,null,null,null,null,null,null,"Setúbal",null,null,null,null,null,null,null,null,null,null,null,null,null,null,null,null,null,null,null,null,null,null,null,null,null,null,null,null,null,null,null,null,null,null,null,null,null,null,null,null,null,null,null,null,null,null,null,null,null,null,null,null,null,null,null,null,null,null,null,null,null,null,null,null,null,null,null,null,null,null,null,null,null,null,null,null,null,null,null,null,null,null,null,null,null,null,null,null,null,null,null,null,null,null,null,null,null,null,null,null,null,null,null,null,null,null,null,null,null,null,null,null,null,null,null,null,null,null,null,null,null,null,null,null,null,null,null,null,null,null,null,null,null,null,null,null,null,null,null,null,null,null,null,null,null,null,null,null,null,null,null,null,null,null,null,null,null,null,null,null,null,null,null,null,null,null,null,null,null,null,null,null,null,null,null,null,null,null,null,null,null,null,null,null,null,null,null,null,null,null,null,null,null,null,null,null,null,null,null,null,null,null,null,null,null,null,null,null,null,null,null,null,null,null,null,null,null,null,null,null,null,null,null,null,null,null,null,null,null,null,null,null,null,null,null,null,null,null,null,null,null,null,null,null,null,null,null,null,null,null,null,null,null,null,null,null,null,null,null,null,null,null,null,null,null,null,null,null,null,null,null,null,null,null,null,null,null,null,null,null,null,null,null,null,null,null,null,null,null,null,null,null,null,null,null,null,null,null,null,null,null,null,null,null,null,null,null,null,null,null,null,null,null,null,null,null,null,null,null,null,null,null,null,null,null,null,null,null,null,null,null,null,null,null,null,null,null,null,null,null,null,null,null,null,null,null,null,null,null,null,null,null,null,null,null,null,null,null,null,null,null,null,null,null,null,null,null,null,null,null,null,null,null,null,null,null,null,null,null,null,null,null,null,null,null,null,null,null,null,null,null,null,null,null,null,null,null,null,null,null,null,null,null,null,null,null,null,null,null,null,null,null,null,null,null,null,null,"Eutrophication Potential (EP)",null,null,null,null,null,null,"Eutrophication Potential (EP)",4,"kg (PO4)3-eq"]
[null,null,null,null,null,null,null,null,null,null,null,null,null,null,null,null,null,null,null,null,null,null,null,null,null,null,null,null,null,null,null,null,null,null,null,null,null,null,null,null,null,null,null,null,null,null,null,null,null,null,null,null,null,null,null,null,null,null,null,null,null,null,null,null,null,null,null,null,null,null,null,null,null,null,null,null,null,null,null,null,null,null,null,null,null,null,null,null,"Sever do Vouga",null,null,null,null,null,null,null,null,null,null,null,null,null,null,null,null,null,null,null,null,null,null,null,null,null,null,null,null,null,null,null,null,null,null,null,null,null,null,null,null,null,null,null,null,null,null,null,null,null,null,null,null,null,null,null,null,null,null,null,null,null,null,null,null,null,null,null,null,null,null,null,null,null,null,null,null,null,null,null,null,null,null,null,null,null,null,null,null,null,null,null,null,null,null,null,null,null,null,null,null,null,null,null,null,null,null,null,null,null,null,null,null,null,null,null,null,null,null,null,null,null,null,null,null,null,null,null,null,null,null,null,null,null,null,null,null,null,null,null,null,null,null,null,null,null,null,null,null,null,null,null,null,null,null,null,null,null,null,null,null,null,null,null,null,null,null,null,null,null,null,null,null,null,null,null,null,null,null,null,null,null,null,null,null,null,null,null,null,null,null,null,null,null,null,null,null,null,null,null,null,null,null,null,null,null,null,null,null,null,null,null,null,null,null,null,null,null,null,null,null,null,null,null,null,null,null,null,null,null,null,null,null,null,null,null,null,null,null,null,null,null,null,null,null,null,null,null,null,null,null,null,null,null,null,null,null,null,null,null,null,null,null,null,null,null,null,null,null,null,null,null,null,null,null,null,null,null,null,null,null,null,null,null,null,null,null,null,null,null,null,null,null,null,null,null,null,null,null,null,null,null,null,null,null,null,null,null,null,null,null,null,null,null,null,null,null,null,null,null,null,null,null,null,null,null,null,null,null,null,null,null,null,null,null,null,null,null,null,null,null,null,null,null,null,null,null,null,null,null,null,null,null,null,null,null,null,null,null,null,null,null,null,null,null,null,null,null,null,null,null,null,null,null,null,null,null,null,null,null,null,null,null,null,null,null,null,null,null,null,null,null,null,null,null,null,null,null,null,null,null,null,null,null,null,null,null,null,null,null,null,null,null,null,null,null,null,null,"Formation Potential of Tropospheric Ozone (POCP)",null,null,null,null,null,null,"Formation Potential of Tropospheric Ozone (POCP)",5,"kg C2H4-eq"]
[null,null,null,null,null,null,null,null,null,null,null,null,null,null,null,null,null,null,null,null,null,null,null,null,null,null,null,null,null,null,null,null,null,null,null,null,null,null,null,null,null,null,null,null,null,null,null,null,null,null,null,null,null,null,null,null,null,null,null,null,null,null,null,null,null,null,null,null,null,null,null,null,null,null,null,null,null,null,null,null,null,null,null,null,null,null,null,null,"Silves",null,null,null,null,null,null,null,null,null,null,null,null,null,null,null,null,null,null,null,null,null,null,null,null,null,null,null,null,null,null,null,null,null,null,null,null,null,null,null,null,null,null,null,null,null,null,null,null,null,null,null,null,null,null,null,null,null,null,null,null,null,null,null,null,null,null,null,null,null,null,null,null,null,null,null,null,null,null,null,null,null,null,null,null,null,null,null,null,null,null,null,null,null,null,null,null,null,null,null,null,null,null,null,null,null,null,null,null,null,null,null,null,null,null,null,null,null,null,null,null,null,null,null,null,null,null,null,null,null,null,null,null,null,null,null,null,null,null,null,null,null,null,null,null,null,null,null,null,null,null,null,null,null,null,null,null,null,null,null,null,null,null,null,null,null,null,null,null,null,null,null,null,null,null,null,null,null,null,null,null,null,null,null,null,null,null,null,null,null,null,null,null,null,null,null,null,null,null,null,null,null,null,null,null,null,null,null,null,null,null,null,null,null,null,null,null,null,null,null,null,null,null,null,null,null,null,null,null,null,null,null,null,null,null,null,null,null,null,null,null,null,null,null,null,null,null,null,null,null,null,null,null,null,null,null,null,null,null,null,null,null,null,null,null,null,null,null,null,null,null,null,null,null,null,null,null,null,null,null,null,null,null,null,null,null,null,null,null,null,null,null,null,null,null,null,null,null,null,null,null,null,null,null,null,null,null,null,null,null,null,null,null,null,null,null,null,null,null,null,null,null,null,null,null,null,null,null,null,null,null,null,null,null,null,null,null,null,null,null,null,null,null,null,null,null,null,null,null,null,null,null,null,null,null,null,null,null,null,null,null,null,null,null,null,null,null,null,null,null,null,null,null,null,null,null,null,null,null,null,null,null,null,null,null,null,null,null,null,null,null,null,null,null,null,null,null,null,null,null,null,null,null,null,null,null,null,null,null,null,null,null,null,null,null,null,null,null,"Global Warming Potential (GWP)",null,null,null,null,null,null,"Global Warming Potential (GWP)",6,"kg CO2-eq"]
[null,null,null,null,null,null,null,null,null,null,null,null,null,null,null,null,null,null,null,null,null,null,null,null,null,null,null,null,null,null,null,null,null,null,null,null,null,null,null,null,null,null,null,null,null,null,null,null,null,null,null,null,null,null,null,null,null,null,null,null,null,null,null,null,null,null,null,null,null,null,null,null,null,null,null,null,null,null,null,null,null,null,null,null,null,null,null,null,"Sines",null,null,null,null,null,null,null,null,null,null,null,null,null,null,null,null,null,null,null,null,null,null,null,null,null,null,null,null,null,null,null,null,null,null,null,null,null,null,null,null,null,null,null,null,null,null,null,null,null,null,null,null,null,null,null,null,null,null,null,null,null,null,null,null,null,null,null,null,null,null,null,null,null,null,null,null,null,null,null,null,null,null,null,null,null,null,null,null,null,null,null,null,null,null,null,null,null,null,null,null,null,null,null,null,null,null,null,null,null,null,null,null,null,null,null,null,null,null,null,null,null,null,null,null,null,null,null,null,null,null,null,null,null,null,null,null,null,null,null,null,null,null,null,null,null,null,null,null,null,null,null,null,null,null,null,null,null,null,null,null,null,null,null,null,null,null,null,null,null,null,null,null,null,null,null,null,null,null,null,null,null,null,null,null,null,null,null,null,null,null,null,null,null,null,null,null,null,null,null,null,null,null,null,null,null,null,null,null,null,null,null,null,null,null,null,null,null,null,null,null,null,null,null,null,null,null,null,null,null,null,null,null,null,null,null,null,null,null,null,null,null,null,null,null,null,null,null,null,null,null,null,null,null,null,null,null,null,null,null,null,null,null,null,null,null,null,null,null,null,null,null,null,null,null,null,null,null,null,null,null,null,null,null,null,null,null,null,null,null,null,null,null,null,null,null,null,null,null,null,null,null,null,null,null,null,null,null,null,null,null,null,null,null,null,null,null,null,null,null,null,null,null,null,null,null,null,null,null,null,null,null,null,null,null,null,null,null,null,null,null,null,null,null,null,null,null,null,null,null,null,null,null,null,null,null,null,null,null,null,null,null,null,null,null,null,null,null,null,null,null,null,null,null,null,null,null,null,null,null,null,null,null,null,null,null,null,null,null,null,null,null,null,null,null,null,null,null,null,null,null,null,null,null,null,null,null,null,null,null,null,null,null,null,null,null,null,null,"Stratospheric Ozone Layer Depletion Potential (ODP)",null,null,null,null,null,null,"Stratospheric Ozone Layer Depletion Potential (ODP)",7,"kg CFC11-eq"]
[null,null,null,null,null,null,null,null,null,null,null,null,null,null,null,null,null,null,null,null,null,null,null,null,null,null,null,null,null,null,null,null,null,null,null,null,null,null,null,null,null,null,null,null,null,null,null,null,null,null,null,null,null,null,null,null,null,null,null,null,null,null,null,null,null,null,null,null,null,null,null,null,null,null,null,null,null,null,null,null,null,null,null,null,null,null,null,null,"Sintra"]
[null,null,null,null,null,null,null,null,null,null,null,null,null,null,null,null,null,null,null,null,null,null,null,null,null,null,null,null,null,null,null,null,null,null,null,null,null,null,null,null,null,null,null,null,null,null,null,null,null,null,null,null,null,null,null,null,null,null,null,null,null,null,null,null,null,null,null,null,null,null,null,null,null,null,null,null,null,null,null,null,null,null,null,null,null,null,null,null,"Sobral de Monte Agraço"]
[null,null,null,null,null,null,null,null,null,null,null,null,null,null,null,null,null,null,null,null,null,null,null,null,null,null,null,null,null,null,null,null,null,null,null,null,null,null,null,null,null,null,null,null,null,null,null,null,null,null,null,null,null,null,null,null,null,null,null,null,null,null,null,null,null,null,null,null,null,null,null,null,null,null,null,null,null,null,null,null,null,null,null,null,null,null,null,null,"Soure"]
[null,null,null,null,null,null,null,null,null,null,null,null,null,null,null,null,null,null,null,null,null,null,null,null,null,null,null,null,null,null,null,null,null,null,null,null,null,null,null,null,null,null,null,null,null,null,null,null,null,null,null,null,null,null,null,null,null,null,null,null,null,null,null,null,null,null,null,null,null,null,null,null,null,null,null,null,null,null,null,null,null,null,null,null,null,null,null,null,"Sousel"]
[null,null,null,null,null,null,null,null,null,null,null,null,null,null,null,null,null,null,null,null,null,null,null,null,null,null,null,null,null,null,null,null,null,null,null,null,null,null,null,null,null,null,null,null,null,null,null,null,null,null,null,null,null,null,null,null,null,null,null,null,null,null,null,null,null,null,null,null,null,null,null,null,null,null,null,null,null,null,null,null,null,null,null,null,null,null,null,null,"Tábua"]
[null,null,null,null,null,null,null,null,null,null,null,null,null,null,null,null,null,null,null,null,null,null,null,null,null,null,null,null,null,null,null,null,null,null,null,null,null,null,null,null,null,null,null,null,null,null,null,null,null,null,null,null,null,null,null,null,null,null,null,null,null,null,null,null,null,null,null,null,null,null,null,null,null,null,null,null,null,null,null,null,null,null,null,null,null,null,null,null,"Tabuaço"]
[null,null,null,null,null,null,null,null,null,null,null,null,null,null,null,null,null,null,null,null,null,null,null,null,null,null,null,null,null,null,null,null,null,null,null,null,null,null,null,null,null,null,null,null,null,null,null,null,null,null,null,null,null,null,null,null,null,null,null,null,null,null,null,null,null,null,null,null,null,null,null,null,null,null,null,null,null,null,null,null,null,null,null,null,null,null,null,null,"Tarouca"]
[null,null,null,null,null,null,null,null,null,null,null,null,null,null,null,null,null,null,null,null,null,null,null,null,null,null,null,null,null,null,null,null,null,null,null,null,null,null,null,null,null,null,null,null,null,null,null,null,null,null,null,null,null,null,null,null,null,null,null,null,null,null,null,null,null,null,null,null,null,null,null,null,null,null,null,null,null,null,null,null,null,null,null,null,null,null,null,null,"Tavira"]
[null,null,null,null,null,null,null,null,null,null,null,null,null,null,null,null,null,null,null,null,null,null,null,null,null,null,null,null,null,null,null,null,null,null,null,null,null,null,null,null,null,null,null,null,null,null,null,null,null,null,null,null,null,null,null,null,null,null,null,null,null,null,null,null,null,null,null,null,null,null,null,null,null,null,null,null,null,null,null,null,null,null,null,null,null,null,null,null,"Terras de Bouro"]
[null,null,null,null,null,null,null,null,null,null,null,null,null,null,null,null,null,null,null,null,null,null,null,null,null,null,null,null,null,null,null,null,null,null,null,null,null,null,null,null,null,null,null,null,null,null,null,null,null,null,null,null,null,null,null,null,null,null,null,null,null,null,null,null,null,null,null,null,null,null,null,null,null,null,null,null,null,null,null,null,null,null,null,null,null,null,null,null,"Tomar"]
[null,null,null,null,null,null,null,null,null,null,null,null,null,null,null,null,null,null,null,null,null,null,null,null,null,null,null,null,null,null,null,null,null,null,null,null,null,null,null,null,null,null,null,null,null,null,null,null,null,null,null,null,null,null,null,null,null,null,null,null,null,null,null,null,null,null,null,null,null,null,null,null,null,null,null,null,null,null,null,null,null,null,null,null,null,null,null,null,"Tondela"]
[null,null,null,null,null,null,null,null,null,null,null,null,null,null,null,null,null,null,null,null,null,null,null,null,null,null,null,null,null,null,null,null,null,null,null,null,null,null,null,null,null,null,null,null,null,null,null,null,null,null,null,null,null,null,null,null,null,null,null,null,null,null,null,null,null,null,null,null,null,null,null,null,null,null,null,null,null,null,null,null,null,null,null,null,null,null,null,null,"Torre de Moncorvo"]
[null,null,null,null,null,null,null,null,null,null,null,null,null,null,null,null,null,null,null,null,null,null,null,null,null,null,null,null,null,null,null,null,null,null,null,null,null,null,null,null,null,null,null,null,null,null,null,null,null,null,null,null,null,null,null,null,null,null,null,null,null,null,null,null,null,null,null,null,null,null,null,null,null,null,null,null,null,null,null,null,null,null,null,null,null,null,null,null,"Torres Novas"]
[null,null,null,null,null,null,null,null,null,null,null,null,null,null,null,null,null,null,null,null,null,null,null,null,null,null,null,null,null,null,null,null,null,null,null,null,null,null,null,null,null,null,null,null,null,null,null,null,null,null,null,null,null,null,null,null,null,null,null,null,null,null,null,null,null,null,null,null,null,null,null,null,null,null,null,null,null,null,null,null,null,null,null,null,null,null,null,null,"Torres Vedras"]
[null,null,null,null,null,null,null,null,null,null,null,null,null,null,null,null,null,null,null,null,null,null,null,null,null,null,null,null,null,null,null,null,null,null,null,null,null,null,null,null,null,null,null,null,null,null,null,null,null,null,null,null,null,null,null,null,null,null,null,null,null,null,null,null,null,null,null,null,null,null,null,null,null,null,null,null,null,null,null,null,null,null,null,null,null,null,null,null,"Trancoso"]
[null,null,null,null,null,null,null,null,null,null,null,null,null,null,null,null,null,null,null,null,null,null,null,null,null,null,null,null,null,null,null,null,null,null,null,null,null,null,null,null,null,null,null,null,null,null,null,null,null,null,null,null,null,null,null,null,null,null,null,null,null,null,null,null,null,null,null,null,null,null,null,null,null,null,null,null,null,null,null,null,null,null,null,null,null,null,null,null,"Trofa"]
[null,null,null,null,null,null,null,null,null,null,null,null,null,null,null,null,null,null,null,null,null,null,null,null,null,null,null,null,null,null,null,null,null,null,null,null,null,null,null,null,null,null,null,null,null,null,null,null,null,null,null,null,null,null,null,null,null,null,null,null,null,null,null,null,null,null,null,null,null,null,null,null,null,null,null,null,null,null,null,null,null,null,null,null,null,null,null,null,"Vagos"]
[null,null,null,null,null,null,null,null,null,null,null,null,null,null,null,null,null,null,null,null,null,null,null,null,null,null,null,null,null,null,null,null,null,null,null,null,null,null,null,null,null,null,null,null,null,null,null,null,null,null,null,null,null,null,null,null,null,null,null,null,null,null,null,null,null,null,null,null,null,null,null,null,null,null,null,null,null,null,null,null,null,null,null,null,null,null,null,null,"Vale de Cambra"]
[null,null,null,null,null,null,null,null,null,null,null,null,null,null,null,null,null,null,null,null,null,null,null,null,null,null,null,null,null,null,null,null,null,null,null,null,null,null,null,null,null,null,null,null,null,null,null,null,null,null,null,null,null,null,null,null,null,null,null,null,null,null,null,null,null,null,null,null,null,null,null,null,null,null,null,null,null,null,null,null,null,null,null,null,null,null,null,null,"Valença"]
[null,null,null,null,null,null,null,null,null,null,null,null,null,null,null,null,null,null,null,null,null,null,null,null,null,null,null,null,null,null,null,null,null,null,null,null,null,null,null,null,null,null,null,null,null,null,null,null,null,null,null,null,null,null,null,null,null,null,null,null,null,null,null,null,null,null,null,null,null,null,null,null,null,null,null,null,null,null,null,null,null,null,null,null,null,null,null,null,"Valongo"]
[null,null,null,null,null,null,null,null,null,null,null,null,null,null,null,null,null,null,null,null,null,null,null,null,null,null,null,null,null,null,null,null,null,null,null,null,null,null,null,null,null,null,null,null,null,null,null,null,null,null,null,null,null,null,null,null,null,null,null,null,null,null,null,null,null,null,null,null,null,null,null,null,null,null,null,null,null,null,null,null,null,null,null,null,null,null,null,null,"Valpaços"]
[null,null,null,null,null,null,null,null,null,null,null,null,null,null,null,null,null,null,null,null,null,null,null,null,null,null,null,null,null,null,null,null,null,null,null,null,null,null,null,null,null,null,null,null,null,null,null,null,null,null,null,null,null,null,null,null,null,null,null,null,null,null,null,null,null,null,null,null,null,null,null,null,null,null,null,null,null,null,null,null,null,null,null,null,null,null,null,null,"Velas"]
[null,null,null,null,null,null,null,null,null,null,null,null,null,null,null,null,null,null,null,null,null,null,null,null,null,null,null,null,null,null,null,null,null,null,null,null,null,null,null,null,null,null,null,null,null,null,null,null,null,null,null,null,null,null,null,null,null,null,null,null,null,null,null,null,null,null,null,null,null,null,null,null,null,null,null,null,null,null,null,null,null,null,null,null,null,null,null,null,"Vendas Novas"]
[null,null,null,null,null,null,null,null,null,null,null,null,null,null,null,null,null,null,null,null,null,null,null,null,null,null,null,null,null,null,null,null,null,null,null,null,null,null,null,null,null,null,null,null,null,null,null,null,null,null,null,null,null,null,null,null,null,null,null,null,null,null,null,null,null,null,null,null,null,null,null,null,null,null,null,null,null,null,null,null,null,null,null,null,null,null,null,null,"Viana do Alentejo"]
[null,null,null,null,null,null,null,null,null,null,null,null,null,null,null,null,null,null,null,null,null,null,null,null,null,null,null,null,null,null,null,null,null,null,null,null,null,null,null,null,null,null,null,null,null,null,null,null,null,null,null,null,null,null,null,null,null,null,null,null,null,null,null,null,null,null,null,null,null,null,null,null,null,null,null,null,null,null,null,null,null,null,null,null,null,null,null,null,"Viana do Castelo"]
[null,null,null,null,null,null,null,null,null,null,null,null,null,null,null,null,null,null,null,null,null,null,null,null,null,null,null,null,null,null,null,null,null,null,null,null,null,null,null,null,null,null,null,null,null,null,null,null,null,null,null,null,null,null,null,null,null,null,null,null,null,null,null,null,null,null,null,null,null,null,null,null,null,null,null,null,null,null,null,null,null,null,null,null,null,null,null,null,"Vidigueira"]
[null,null,null,null,null,null,null,null,null,null,null,null,null,null,null,null,null,null,null,null,null,null,null,null,null,null,null,null,null,null,null,null,null,null,null,null,null,null,null,null,null,null,null,null,null,null,null,null,null,null,null,null,null,null,null,null,null,null,null,null,null,null,null,null,null,null,null,null,null,null,null,null,null,null,null,null,null,null,null,null,null,null,null,null,null,null,null,null,"Vieira do Minho"]
[null,null,null,null,null,null,null,null,null,null,null,null,null,null,null,null,null,null,null,null,null,null,null,null,null,null,null,null,null,null,null,null,null,null,null,null,null,null,null,null,null,null,null,null,null,null,null,null,null,null,null,null,null,null,null,null,null,null,null,null,null,null,null,null,null,null,null,null,null,null,null,null,null,null,null,null,null,null,null,null,null,null,null,null,null,null,null,null,"Vila de Rei"]
[null,null,null,null,null,null,null,null,null,null,null,null,null,null,null,null,null,null,null,null,null,null,null,null,null,null,null,null,null,null,null,null,null,null,null,null,null,null,null,null,null,null,null,null,null,null,null,null,null,null,null,null,null,null,null,null,null,null,null,null,null,null,null,null,null,null,null,null,null,null,null,null,null,null,null,null,null,null,null,null,null,null,null,null,null,null,null,null,"Vila do Bispo"]
[null,null,null,null,null,null,null,null,null,null,null,null,null,null,null,null,null,null,null,null,null,null,null,null,null,null,null,null,null,null,null,null,null,null,null,null,null,null,null,null,null,null,null,null,null,null,null,null,null,null,null,null,null,null,null,null,null,null,null,null,null,null,null,null,null,null,null,null,null,null,null,null,null,null,null,null,null,null,null,null,null,null,null,null,null,null,null,null,"Vila do Conde"]
[null,null,null,null,null,null,null,null,null,null,null,null,null,null,null,null,null,null,null,null,null,null,null,null,null,null,null,null,null,null,null,null,null,null,null,null,null,null,null,null,null,null,null,null,null,null,null,null,null,null,null,null,null,null,null,null,null,null,null,null,null,null,null,null,null,null,null,null,null,null,null,null,null,null,null,null,null,null,null,null,null,null,null,null,null,null,null,null,"Vila do Corvo"]
[null,null,null,null,null,null,null,null,null,null,null,null,null,null,null,null,null,null,null,null,null,null,null,null,null,null,null,null,null,null,null,null,null,null,null,null,null,null,null,null,null,null,null,null,null,null,null,null,null,null,null,null,null,null,null,null,null,null,null,null,null,null,null,null,null,null,null,null,null,null,null,null,null,null,null,null,null,null,null,null,null,null,null,null,null,null,null,null,"Vila do Porto"]
[null,null,null,null,null,null,null,null,null,null,null,null,null,null,null,null,null,null,null,null,null,null,null,null,null,null,null,null,null,null,null,null,null,null,null,null,null,null,null,null,null,null,null,null,null,null,null,null,null,null,null,null,null,null,null,null,null,null,null,null,null,null,null,null,null,null,null,null,null,null,null,null,null,null,null,null,null,null,null,null,null,null,null,null,null,null,null,null,"Vila Flor"]
[null,null,null,null,null,null,null,null,null,null,null,null,null,null,null,null,null,null,null,null,null,null,null,null,null,null,null,null,null,null,null,null,null,null,null,null,null,null,null,null,null,null,null,null,null,null,null,null,null,null,null,null,null,null,null,null,null,null,null,null,null,null,null,null,null,null,null,null,null,null,null,null,null,null,null,null,null,null,null,null,null,null,null,null,null,null,null,null,"Vila Franca de Xira"]
[null,null,null,null,null,null,null,null,null,null,null,null,null,null,null,null,null,null,null,null,null,null,null,null,null,null,null,null,null,null,null,null,null,null,null,null,null,null,null,null,null,null,null,null,null,null,null,null,null,null,null,null,null,null,null,null,null,null,null,null,null,null,null,null,null,null,null,null,null,null,null,null,null,null,null,null,null,null,null,null,null,null,null,null,null,null,null,null,"Vila Franca do Campo"]
[null,null,null,null,null,null,null,null,null,null,null,null,null,null,null,null,null,null,null,null,null,null,null,null,null,null,null,null,null,null,null,null,null,null,null,null,null,null,null,null,null,null,null,null,null,null,null,null,null,null,null,null,null,null,null,null,null,null,null,null,null,null,null,null,null,null,null,null,null,null,null,null,null,null,null,null,null,null,null,null,null,null,null,null,null,null,null,null,"Vila Nova da Barquinha"]
[null,null,null,null,null,null,null,null,null,null,null,null,null,null,null,null,null,null,null,null,null,null,null,null,null,null,null,null,null,null,null,null,null,null,null,null,null,null,null,null,null,null,null,null,null,null,null,null,null,null,null,null,null,null,null,null,null,null,null,null,null,null,null,null,null,null,null,null,null,null,null,null,null,null,null,null,null,null,null,null,null,null,null,null,null,null,null,null,"Vila Nova de Cerveira"]
[null,null,null,null,null,null,null,null,null,null,null,null,null,null,null,null,null,null,null,null,null,null,null,null,null,null,null,null,null,null,null,null,null,null,null,null,null,null,null,null,null,null,null,null,null,null,null,null,null,null,null,null,null,null,null,null,null,null,null,null,null,null,null,null,null,null,null,null,null,null,null,null,null,null,null,null,null,null,null,null,null,null,null,null,null,null,null,null,"Vila Nova de Famalicão"]
[null,null,null,null,null,null,null,null,null,null,null,null,null,null,null,null,null,null,null,null,null,null,null,null,null,null,null,null,null,null,null,null,null,null,null,null,null,null,null,null,null,null,null,null,null,null,null,null,null,null,null,null,null,null,null,null,null,null,null,null,null,null,null,null,null,null,null,null,null,null,null,null,null,null,null,null,null,null,null,null,null,null,null,null,null,null,null,null,"Vila Nova de Foz Côa"]
[null,null,null,null,null,null,null,null,null,null,null,null,null,null,null,null,null,null,null,null,null,null,null,null,null,null,null,null,null,null,null,null,null,null,null,null,null,null,null,null,null,null,null,null,null,null,null,null,null,null,null,null,null,null,null,null,null,null,null,null,null,null,null,null,null,null,null,null,null,null,null,null,null,null,null,null,null,null,null,null,null,null,null,null,null,null,null,null,"Vila Nova de Gaia"]
[null,null,null,null,null,null,null,null,null,null,null,null,null,null,null,null,null,null,null,null,null,null,null,null,null,null,null,null,null,null,null,null,null,null,null,null,null,null,null,null,null,null,null,null,null,null,null,null,null,null,null,null,null,null,null,null,null,null,null,null,null,null,null,null,null,null,null,null,null,null,null,null,null,null,null,null,null,null,null,null,null,null,null,null,null,null,null,null,"Vila Nova de Paiva"]
[null,null,null,null,null,null,null,null,null,null,null,null,null,null,null,null,null,null,null,null,null,null,null,null,null,null,null,null,null,null,null,null,null,null,null,null,null,null,null,null,null,null,null,null,null,null,null,null,null,null,null,null,null,null,null,null,null,null,null,null,null,null,null,null,null,null,null,null,null,null,null,null,null,null,null,null,null,null,null,null,null,null,null,null,null,null,null,null,"Vila Nova de Poiares"]
[null,null,null,null,null,null,null,null,null,null,null,null,null,null,null,null,null,null,null,null,null,null,null,null,null,null,null,null,null,null,null,null,null,null,null,null,null,null,null,null,null,null,null,null,null,null,null,null,null,null,null,null,null,null,null,null,null,null,null,null,null,null,null,null,null,null,null,null,null,null,null,null,null,null,null,null,null,null,null,null,null,null,null,null,null,null,null,null,"Vila Pouca de Aguiar"]
[null,null,null,null,null,null,null,null,null,null,null,null,null,null,null,null,null,null,null,null,null,null,null,null,null,null,null,null,null,null,null,null,null,null,null,null,null,null,null,null,null,null,null,null,null,null,null,null,null,null,null,null,null,null,null,null,null,null,null,null,null,null,null,null,null,null,null,null,null,null,null,null,null,null,null,null,null,null,null,null,null,null,null,null,null,null,null,null,"Vila Real"]
[null,null,null,null,null,null,null,null,null,null,null,null,null,null,null,null,null,null,null,null,null,null,null,null,null,null,null,null,null,null,null,null,null,null,null,null,null,null,null,null,null,null,null,null,null,null,null,null,null,null,null,null,null,null,null,null,null,null,null,null,null,null,null,null,null,null,null,null,null,null,null,null,null,null,null,null,null,null,null,null,null,null,null,null,null,null,null,null,"Vila Real de Santo António"]
[null,null,null,null,null,null,null,null,null,null,null,null,null,null,null,null,null,null,null,null,null,null,null,null,null,null,null,null,null,null,null,null,null,null,null,null,null,null,null,null,null,null,null,null,null,null,null,null,null,null,null,null,null,null,null,null,null,null,null,null,null,null,null,null,null,null,null,null,null,null,null,null,null,null,null,null,null,null,null,null,null,null,null,null,null,null,null,null,"Vila Velha de Ródão"]
[null,null,null,null,null,null,null,null,null,null,null,null,null,null,null,null,null,null,null,null,null,null,null,null,null,null,null,null,null,null,null,null,null,null,null,null,null,null,null,null,null,null,null,null,null,null,null,null,null,null,null,null,null,null,null,null,null,null,null,null,null,null,null,null,null,null,null,null,null,null,null,null,null,null,null,null,null,null,null,null,null,null,null,null,null,null,null,null,"Vila Verde"]
[null,null,null,null,null,null,null,null,null,null,null,null,null,null,null,null,null,null,null,null,null,null,null,null,null,null,null,null,null,null,null,null,null,null,null,null,null,null,null,null,null,null,null,null,null,null,null,null,null,null,null,null,null,null,null,null,null,null,null,null,null,null,null,null,null,null,null,null,null,null,null,null,null,null,null,null,null,null,null,null,null,null,null,null,null,null,null,null,"Vila Viçosa"]
[null,null,null,null,null,null,null,null,null,null,null,null,null,null,null,null,null,null,null,null,null,null,null,null,null,null,null,null,null,null,null,null,null,null,null,null,null,null,null,null,null,null,null,null,null,null,null,null,null,null,null,null,null,null,null,null,null,null,null,null,null,null,null,null,null,null,null,null,null,null,null,null,null,null,null,null,null,null,null,null,null,null,null,null,null,null,null,null,"Vimioso"]
[null,null,null,null,null,null,null,null,null,null,null,null,null,null,null,null,null,null,null,null,null,null,null,null,null,null,null,null,null,null,null,null,null,null,null,null,null,null,null,null,null,null,null,null,null,null,null,null,null,null,null,null,null,null,null,null,null,null,null,null,null,null,null,null,null,null,null,null,null,null,null,null,null,null,null,null,null,null,null,null,null,null,null,null,null,null,null,null,"Vinhais"]
[null,null,null,null,null,null,null,null,null,null,null,null,null,null,null,null,null,null,null,null,null,null,null,null,null,null,null,null,null,null,null,null,null,null,null,null,null,null,null,null,null,null,null,null,null,null,null,null,null,null,null,null,null,null,null,null,null,null,null,null,null,null,null,null,null,null,null,null,null,null,null,null,null,null,null,null,null,null,null,null,null,null,null,null,null,null,null,null,"Viseu"]
[null,null,null,null,null,null,null,null,null,null,null,null,null,null,null,null,null,null,null,null,null,null,null,null,null,null,null,null,null,null,null,null,null,null,null,null,null,null,null,null,null,null,null,null,null,null,null,null,null,null,null,null,null,null,null,null,null,null,null,null,null,null,null,null,null,null,null,null,null,null,null,null,null,null,null,null,null,null,null,null,null,null,null,null,null,null,null,null,"Vizela"]
[null,null,null,null,null,null,null,null,null,null,null,null,null,null,null,null,null,null,null,null,null,null,null,null,null,null,null,null,null,null,null,null,null,null,null,null,null,null,null,null,null,null,null,null,null,null,null,null,null,null,null,null,null,null,null,null,null,null,null,null,null,null,null,null,null,null,null,null,null,null,null,null,null,null,null,null,null,null,null,null,null,null,null,null,null,null,null,null,"Vouzela"]